BDBM50041886 3-(Bicyclo[2.2.1]hept-2-yloxy)-N-(2,6-dichloro-phenyl)-4-methoxy-benzamide::CHEMBL300290
SMILES: COc1ccc(cc1OC1CC2CCC1C2)C(=O)Nc1c(Cl)cccc1Cl
InChI Key: InChIKey=JITWRUMFYWXWGT-UHFFFAOYSA-N
Data: 1 IC50
Activity Spreadsheet -- Enzyme Inhibition Constant Data from BindingDB
Found 1 hit for monomerid = 50041886
Trg + Lig
Ki
nM
ΔG°
kcal/mole
IC50
nM
Kd
nM
EC50/IC50
nM
koff
s-1
kon
M-1s-1
pHTemp
°C
Phosphodiesterase 4A
(Sus scrofa)
BDBM50041886
(3-(Bicyclo[2.2.1]hept-2-yloxy)-N-(2,6-dichloro-phe...)
Show SMILES COc1ccc(cc1OC1CC2CCC1C2)C(=O)Nc1c(Cl)cccc1Cl |TLB:8:9:15:13.12|
Show InChI InChI=1S/C21H21Cl2NO3/c1-26-17-8-7-14(21(25)24-20-15(22)3-2-4-16(20)23)11-19(17)27-18-10-12-5-6-13(18)9-12/h2-4,7-8,11-13,18H,5-6,9-10H2,1H3,(H,24,25)
n/an/a 10n/an/an/an/an/an/a
Rhône-Poulenc Rorer Central Research
Curated by ChEMBL
Assay Description
Inhibitory potency against pig aortic PDE IV
J Med Chem 37: 1696-703 (1994)
BindingDB Entry DOI: 10.7270/Q2CF9P5F