null
SMILES: CC1(C)S[C@@H](NC1C(=O)NCC(O)CNC(=O)[C@@H]1N[C@H](SC1(C)C)[C@H](NC(=O)Cc1ccccc1)C(=O)NCc1ccccc1)[C@H](NC(=O)Cc1ccccc1)C(=O)NCc1ccccc1
InChI Key: InChIKey=GXCDCTCRXPBCGV-YZCMBOKNSA-N
Activity Spreadsheet -- Enzyme Inhibition Constant Data from BindingDB
Found 1 hit for monomerid = 50041944
Trg + Lig
Ki
nM
ΔG°
kcal/mole
IC50
nM
Kd
nM
EC50/IC50
nM
koff
s-1
kon
M-1s-1
pHTemp
°C
Gag-Pol polyprotein [489-587]
(Human immunodeficiency virus type 1)
BDBM50041944
(1N-benzyl-2-[4-{3-[2-benzylcarbamoyl(benzylcarboxa...)
Show SMILES CC1(C)S[C@@H](NC1C(=O)NCC(O)CNC(=O)[C@@H]1N[C@H](SC1(C)C)[C@H](NC(=O)Cc1ccccc1)C(=O)NCc1ccccc1)[C@H](NC(=O)Cc1ccccc1)C(=O)NCc1ccccc1
Show InChI InChI=1S/C49H60N8O7S2/c1-48(2)40(56-46(65-48)38(42(61)50-27-33-21-13-7-14-22-33)54-36(59)25-31-17-9-5-10-18-31)44(63)52-29-35(58)30-53-45(64)41-49(3,4)66-47(57-41)39(43(62)51-28-34-23-15-8-16-24-34)55-37(60)26-32-19-11-6-12-20-32/h5-24,35,38-41,46-47,56-58H,25-30H2,1-4H3,(H,50,61)(H,51,62)(H,52,63)(H,53,64)(H,54,59)(H,55,60)/t35?,38-,39-,40+,41?,46-,47-/m1/s1
n/an/a 5n/an/an/an/an/an/a
Glaxo Group Research Limited
Curated by ChEMBL
Assay Description
Inhibitory activity against HIV-1 Protease
J Med Chem 36: 3113-9 (1993)
BindingDB Entry DOI: 10.7270/Q2057F0C