BDBM50041986 CHEMBL3359517
SMILES: COc1ccc(COc2ccc3n4CCC(CC(O)=O)c4cc3c2)cc1C#N
InChI Key: InChIKey=CQJMGIUYXGQKNP-UHFFFAOYSA-N
Data: 1 EC50
Activity Spreadsheet -- Enzyme Inhibition Constant Data from BindingDB
Found 1 hit for monomerid = 50041986
Trg + Lig
Ki
nM
ΔG°
kcal/mole
IC50
nM
Kd
nM
EC50/IC50
nM
koff
s-1
kon
M-1s-1
pHTemp
°C
Sphingosine 1-phosphate receptor 1
(Homo sapiens (Human))
BDBM50041986
(CHEMBL3359517)
Show SMILES COc1ccc(COc2ccc3n4CCC(CC(O)=O)c4cc3c2)cc1C#N
Show InChI InChI=1S/C22H20N2O4/c1-27-21-5-2-14(8-17(21)12-23)13-28-18-3-4-19-16(9-18)10-20-15(11-22(25)26)6-7-24(19)20/h2-5,8-10,15H,6-7,11,13H2,1H3,(H,25,26)
Reactome pathway
n/an/an/an/a 38n/an/an/an/a
Arena Pharmaceuticals, Inc.
Curated by ChEMBL
Assay Description
Agonist activity at human S1P1 receptor assessed as cAMP accumulation by HTRF assay
ACS Med Chem Lett 5: 1334-9 (2014)
Article DOI: 10.1021/ml500422m
BindingDB Entry DOI: 10.7270/Q2XK8H6S