BDBM50042038 CHEMBL3360168
SMILES: CCn1c(Nc2ccncc2F)nc2c(CCCO)csc2c1=O
InChI Key: InChIKey=AABLQBRGBFMNIT-UHFFFAOYSA-N
Data: 2 IC50
Activity Spreadsheet -- Enzyme Inhibition Constant Data from BindingDB
Found 2 hits for monomerid = 50042038
Trg + Lig
Ki
nM
ΔG°
kcal/mole
IC50
nM
Kd
nM
EC50/IC50
nM
koff
s-1
kon
M-1s-1
pHTemp
°C
cAMP-specific 3',5'-cyclic phosphodiesterase 4B
(Homo sapiens (Human))
BDBM50042038
(CHEMBL3360168)
Show SMILES CCn1c(Nc2ccncc2F)nc2c(CCCO)csc2c1=O
Show InChI InChI=1S/C16H17FN4O2S/c1-2-21-15(23)14-13(10(9-24-14)4-3-7-22)20-16(21)19-12-5-6-18-8-11(12)17/h5-6,8-9,22H,2-4,7H2,1H3,(H,18,19,20)
n/an/a 180n/an/an/an/an/an/a
Kyoto 607-8042
Curated by ChEMBL
Assay Description
Inhibition of PDE4B (unknown origin)
Bioorg Med Chem Lett 25: 649-53 (2015)
Article DOI: 10.1016/j.bmcl.2014.11.090
BindingDB Entry DOI: 10.7270/Q2542Q6P
Phosphodiesterase 7
(Homo sapiens (Human))
BDBM50042038
(CHEMBL3360168)
Show SMILES CCn1c(Nc2ccncc2F)nc2c(CCCO)csc2c1=O
Show InChI InChI=1S/C16H17FN4O2S/c1-2-21-15(23)14-13(10(9-24-14)4-3-7-22)20-16(21)19-12-5-6-18-8-11(12)17/h5-6,8-9,22H,2-4,7H2,1H3,(H,18,19,20)
Reactome pathway
n/an/a 3.90n/an/an/an/an/an/a
Kyoto 607-8042
Curated by ChEMBL
Assay Description
Inhibition of PDE7A (unknown origin)
Bioorg Med Chem Lett 25: 649-53 (2015)
Article DOI: 10.1016/j.bmcl.2014.11.090
BindingDB Entry DOI: 10.7270/Q2542Q6P