BDBM50042426 3-(2-Benzyloxycarbonylamino-4-methyl-pentanoylamino)-2-oxo-4-phenyl-butyric acid butyl ester::CHEMBL117450
SMILES: CCCCOC(=O)C(=O)C(Cc1ccccc1)NC(=O)C(CC(C)C)NC(=O)OCc1ccccc1
InChI Key: InChIKey=DWAGOXRYPXDHHS-UHFFFAOYSA-N
Data: 4 KI
Activity Spreadsheet -- Enzyme Inhibition Constant Data from BindingDB
Found 4 hits for monomerid = 50042426
Trg + Lig
Ki
nM
ΔG°
kcal/mole
IC50
nM
Kd
nM
EC50/IC50
nM
koff
s-1
kon
M-1s-1
pHTemp
°C
Calpain-2 (m-Calpain)
(Homo sapiens (Human))
BDBM50042426
(3-(2-Benzyloxycarbonylamino-4-methyl-pentanoylamin...)
Show SMILES CCCCOC(=O)C(=O)C(Cc1ccccc1)NC(=O)C(CC(C)C)NC(=O)OCc1ccccc1
Show InChI InChI=1S/C28H36N2O6/c1-4-5-16-35-27(33)25(31)23(18-21-12-8-6-9-13-21)29-26(32)24(17-20(2)3)30-28(34)36-19-22-14-10-7-11-15-22/h6-15,20,23-24H,4-5,16-19H2,1-3H3,(H,29,32)(H,30,34)
1.10E+3n/an/an/an/an/an/a8.0n/a
School of Chemistry and Biochemistry
Curated by ChEMBL
Assay Description
Inhibitory activity of alpha-keto esters towards calpain 2 at pH 8.0
J Med Chem 36: 3472-80 (1993)
BindingDB Entry DOI: 10.7270/Q2F76BK3
Calpain 1/small subunit 1
(Homo sapiens (Human))
BDBM50042426
(3-(2-Benzyloxycarbonylamino-4-methyl-pentanoylamin...)
Show SMILES CCCCOC(=O)C(=O)C(Cc1ccccc1)NC(=O)C(CC(C)C)NC(=O)OCc1ccccc1
Show InChI InChI=1S/C28H36N2O6/c1-4-5-16-35-27(33)25(31)23(18-21-12-8-6-9-13-21)29-26(32)24(17-20(2)3)30-28(34)36-19-22-14-10-7-11-15-22/h6-15,20,23-24H,4-5,16-19H2,1-3H3,(H,29,32)(H,30,34)
Reactome pathway
5.00E+3n/an/an/an/an/an/an/an/a
School of Chemistry and Biochemistry
Curated by ChEMBL
Assay Description
Inhibitory activity of alpha-keto esters towards calpain 1 at pH 8.0.
J Med Chem 36: 3472-80 (1993)
BindingDB Entry DOI: 10.7270/Q2F76BK3
Cathepsin B
(Bos taurus (bovine))
BDBM50042426
(3-(2-Benzyloxycarbonylamino-4-methyl-pentanoylamin...)
Show SMILES CCCCOC(=O)C(=O)C(Cc1ccccc1)NC(=O)C(CC(C)C)NC(=O)OCc1ccccc1
Show InChI InChI=1S/C28H36N2O6/c1-4-5-16-35-27(33)25(31)23(18-21-12-8-6-9-13-21)29-26(32)24(17-20(2)3)30-28(34)36-19-22-14-10-7-11-15-22/h6-15,20,23-24H,4-5,16-19H2,1-3H3,(H,29,32)(H,30,34)
Reactome pathway
1.50E+4n/an/an/an/an/an/a5.2n/a
School of Chemistry and Biochemistry
Curated by ChEMBL
Assay Description
Inhibition of alpha-keto esters towards cathepsin B at pH 5.2
J Med Chem 36: 3472-80 (1993)
BindingDB Entry DOI: 10.7270/Q2F76BK3
Papain
(Carica papaya)
BDBM50042426
(3-(2-Benzyloxycarbonylamino-4-methyl-pentanoylamin...)
Show SMILES CCCCOC(=O)C(=O)C(Cc1ccccc1)NC(=O)C(CC(C)C)NC(=O)OCc1ccccc1
Show InChI InChI=1S/C28H36N2O6/c1-4-5-16-35-27(33)25(31)23(18-21-12-8-6-9-13-21)29-26(32)24(17-20(2)3)30-28(34)36-19-22-14-10-7-11-15-22/h6-15,20,23-24H,4-5,16-19H2,1-3H3,(H,29,32)(H,30,34)
1.50E+4n/an/an/an/an/an/a6.0n/a
School of Chemistry and Biochemistry
Curated by ChEMBL
Assay Description
Inhibitory activity of alpha-ketoesters towards papain at pH 6.0
J Med Chem 36: 3472-80 (1993)
BindingDB Entry DOI: 10.7270/Q2F76BK3