BDBM50042543 5-Butyl-2-(2,4-dichloro-phenyl)-4-[2'-(1H-tetrazol-5-yl)-biphenyl-4-ylmethyl]-2H-pyrazole-3-carboxylic acid::CHEMBL92472
SMILES: CCCCc1nn(c(C(O)=O)c1Cc1ccc(cc1)-c1ccccc1-c1nnn[nH]1)-c1ccc(Cl)cc1Cl
InChI Key: InChIKey=ZMIPXYJMLBJAOL-UHFFFAOYSA-N
Data: 1 KI  3 IC50
Activity Spreadsheet -- Enzyme Inhibition Constant Data from BindingDB
Found 4 hits for monomerid = 50042543
Trg + Lig
Ki
nM
ΔG°
kcal/mole
IC50
nM
Kd
nM
EC50/IC50
nM
koff
s-1
kon
M-1s-1
pHTemp
°C
Renal dipeptidase
(GUINEA PIG)
BDBM50042543
(5-Butyl-2-(2,4-dichloro-phenyl)-4-[2'-(1H-tetrazol...)
Show SMILES CCCCc1nn(c(C(O)=O)c1Cc1ccc(cc1)-c1ccccc1-c1nnn[nH]1)-c1ccc(Cl)cc1Cl
Show InChI InChI=1S/C28H24Cl2N6O2/c1-2-3-8-24-22(26(28(37)38)36(33-24)25-14-13-19(29)16-23(25)30)15-17-9-11-18(12-10-17)20-6-4-5-7-21(20)27-31-34-35-32-27/h4-7,9-14,16H,2-3,8,15H2,1H3,(H,37,38)(H,31,32,34,35)
4.00E+5n/an/an/an/an/an/an/an/a
Merck Research Laboratories
Curated by ChEMBL
Assay Description
In vitro apparent inhibition constant of porcine renal Dehydropeptidase-1.
Bioorg Med Chem Lett 9: 2741-6 (1999)
BindingDB Entry DOI: 10.7270/Q24Q7T6C
Angiotensin II type 1a (AT-1a) receptor
(RABBIT)
BDBM50042543
(5-Butyl-2-(2,4-dichloro-phenyl)-4-[2'-(1H-tetrazol...)
Show SMILES CCCCc1nn(c(C(O)=O)c1Cc1ccc(cc1)-c1ccccc1-c1nnn[nH]1)-c1ccc(Cl)cc1Cl
Show InChI InChI=1S/C28H24Cl2N6O2/c1-2-3-8-24-22(26(28(37)38)36(33-24)25-14-13-19(29)16-23(25)30)15-17-9-11-18(12-10-17)20-6-4-5-7-21(20)27-31-34-35-32-27/h4-7,9-14,16H,2-3,8,15H2,1H3,(H,37,38)(H,31,32,34,35)
n/an/a 0.600n/an/an/an/an/an/a
Merck Research Laboratories
Curated by ChEMBL
Assay Description
Evaluation of Angiotensin II antagonistic activity by displacement of [125I]-Sar Ile-AII at the rabbit aorta Angiotensin II receptor, type 1
J Med Chem 36: 3595-605 (1994)
BindingDB Entry DOI: 10.7270/Q25Q4V5H
metallo-beta-lactamase IMP-1
(Pseudomonas aeruginosa)
BDBM50042543
(5-Butyl-2-(2,4-dichloro-phenyl)-4-[2'-(1H-tetrazol...)
Show SMILES CCCCc1nn(c(C(O)=O)c1Cc1ccc(cc1)-c1ccccc1-c1nnn[nH]1)-c1ccc(Cl)cc1Cl
Show InChI InChI=1S/C28H24Cl2N6O2/c1-2-3-8-24-22(26(28(37)38)36(33-24)25-14-13-19(29)16-23(25)30)15-17-9-11-18(12-10-17)20-6-4-5-7-21(20)27-31-34-35-32-27/h4-7,9-14,16H,2-3,8,15H2,1H3,(H,37,38)(H,31,32,34,35)
n/an/a>2.00E+5n/an/an/an/an/an/a
Merck Research Laboratories
Curated by ChEMBL
Assay Description
Inhibition of metallo-beta-lactamase (MBL) from Pseudomonas aeruginosa mediated by the plasmid-borne IMP-1 enzyme.
Bioorg Med Chem Lett 9: 2741-6 (1999)
BindingDB Entry DOI: 10.7270/Q24Q7T6C
Beta-lactamase type II
(Bacteroides fragilis)
BDBM50042543
(5-Butyl-2-(2,4-dichloro-phenyl)-4-[2'-(1H-tetrazol...)
Show SMILES CCCCc1nn(c(C(O)=O)c1Cc1ccc(cc1)-c1ccccc1-c1nnn[nH]1)-c1ccc(Cl)cc1Cl
Show InChI InChI=1S/C28H24Cl2N6O2/c1-2-3-8-24-22(26(28(37)38)36(33-24)25-14-13-19(29)16-23(25)30)15-17-9-11-18(12-10-17)20-6-4-5-7-21(20)27-31-34-35-32-27/h4-7,9-14,16H,2-3,8,15H2,1H3,(H,37,38)(H,31,32,34,35)
NCI pathway
Reactome pathway
n/an/a 8.00E+4n/an/an/an/an/an/a
Merck Research Laboratories
Curated by ChEMBL
Assay Description
Inhibition of metallo-beta-lactamase (MBL) from Bacteroides fragilis.
Bioorg Med Chem Lett 9: 2741-6 (1999)
BindingDB Entry DOI: 10.7270/Q24Q7T6C