BDBM50042555 5-Butyl-2-phenyl-4-[2'-(1H-tetrazol-5-yl)-biphenyl-4-ylmethyl]-2H-pyrazole-3-carboxylic acid::CHEMBL327982
SMILES: CCCCc1nn(c(C(O)=O)c1Cc1ccc(cc1)-c1ccccc1-c1nnn[nH]1)-c1ccccc1
InChI Key: InChIKey=XVYBSTMVIVLXAO-UHFFFAOYSA-N
Data: 1 KI  3 IC50
Activity Spreadsheet -- Enzyme Inhibition Constant Data from BindingDB
Found 4 hits for monomerid = 50042555
Trg + Lig
Ki
nM
ΔG°
kcal/mole
IC50
nM
Kd
nM
EC50/IC50
nM
koff
s-1
kon
M-1s-1
pHTemp
°C
Renal dipeptidase
(GUINEA PIG)
BDBM50042555
(5-Butyl-2-phenyl-4-[2'-(1H-tetrazol-5-yl)-biphenyl...)
Show SMILES CCCCc1nn(c(C(O)=O)c1Cc1ccc(cc1)-c1ccccc1-c1nnn[nH]1)-c1ccccc1
Show InChI InChI=1S/C28H26N6O2/c1-2-3-13-25-24(26(28(35)36)34(31-25)21-9-5-4-6-10-21)18-19-14-16-20(17-15-19)22-11-7-8-12-23(22)27-29-32-33-30-27/h4-12,14-17H,2-3,13,18H2,1H3,(H,35,36)(H,29,30,32,33)
5.90E+5n/an/an/an/an/an/an/an/a
Merck Research Laboratories
Curated by ChEMBL
Assay Description
In vitro apparent inhibition constant of porcine renal Dehydropeptidase-1.
Bioorg Med Chem Lett 9: 2741-6 (1999)
BindingDB Entry DOI: 10.7270/Q24Q7T6C
Angiotensin II type 1a (AT-1a) receptor
(RABBIT)
BDBM50042555
(5-Butyl-2-phenyl-4-[2'-(1H-tetrazol-5-yl)-biphenyl...)
Show SMILES CCCCc1nn(c(C(O)=O)c1Cc1ccc(cc1)-c1ccccc1-c1nnn[nH]1)-c1ccccc1
Show InChI InChI=1S/C28H26N6O2/c1-2-3-13-25-24(26(28(35)36)34(31-25)21-9-5-4-6-10-21)18-19-14-16-20(17-15-19)22-11-7-8-12-23(22)27-29-32-33-30-27/h4-12,14-17H,2-3,13,18H2,1H3,(H,35,36)(H,29,30,32,33)
n/an/a 2.90n/an/an/an/an/an/a
Merck Research Laboratories
Curated by ChEMBL
Assay Description
Evaluation of Angiotensin II antagonistic activity by displacement of [125I]-Sar Ile-AII at the rabbit aorta Angiotensin II receptor, type 1
J Med Chem 36: 3595-605 (1994)
BindingDB Entry DOI: 10.7270/Q25Q4V5H
metallo-beta-lactamase IMP-1
(Pseudomonas aeruginosa)
BDBM50042555
(5-Butyl-2-phenyl-4-[2'-(1H-tetrazol-5-yl)-biphenyl...)
Show SMILES CCCCc1nn(c(C(O)=O)c1Cc1ccc(cc1)-c1ccccc1-c1nnn[nH]1)-c1ccccc1
Show InChI InChI=1S/C28H26N6O2/c1-2-3-13-25-24(26(28(35)36)34(31-25)21-9-5-4-6-10-21)18-19-14-16-20(17-15-19)22-11-7-8-12-23(22)27-29-32-33-30-27/h4-12,14-17H,2-3,13,18H2,1H3,(H,35,36)(H,29,30,32,33)
n/an/a>2.00E+5n/an/an/an/an/an/a
Merck Research Laboratories
Curated by ChEMBL
Assay Description
Inhibition of metallo-beta-lactamase (MBL) from Pseudomonas aeruginosa mediated by the plasmid-borne IMP-1 enzyme.
Bioorg Med Chem Lett 9: 2741-6 (1999)
BindingDB Entry DOI: 10.7270/Q24Q7T6C
Beta-lactamase type II
(Bacteroides fragilis)
BDBM50042555
(5-Butyl-2-phenyl-4-[2'-(1H-tetrazol-5-yl)-biphenyl...)
Show SMILES CCCCc1nn(c(C(O)=O)c1Cc1ccc(cc1)-c1ccccc1-c1nnn[nH]1)-c1ccccc1
Show InChI InChI=1S/C28H26N6O2/c1-2-3-13-25-24(26(28(35)36)34(31-25)21-9-5-4-6-10-21)18-19-14-16-20(17-15-19)22-11-7-8-12-23(22)27-29-32-33-30-27/h4-12,14-17H,2-3,13,18H2,1H3,(H,35,36)(H,29,30,32,33)
NCI pathway
Reactome pathway
n/an/a 2.00E+5n/an/an/an/an/an/a
Merck Research Laboratories
Curated by ChEMBL
Assay Description
Inhibition of metallo-beta-lactamase (MBL) from Bacteroides fragilis.
Bioorg Med Chem Lett 9: 2741-6 (1999)
BindingDB Entry DOI: 10.7270/Q24Q7T6C