null
SMILES: CCCCc1nn(c(C(O)=O)c1Cc1ccc(cc1)-c1ccccc1-c1nnn[nH]1)-c1c(Cl)cc(Cl)cc1Cl
InChI Key: InChIKey=RJLFDNUPQRZLGJ-UHFFFAOYSA-N
Activity Spreadsheet -- Enzyme Inhibition Constant Data from BindingDB
Found 4 hits for monomerid = 50042576
Trg + Lig
Ki
nM
ΔG°
kcal/mole
IC50
nM
Kd
nM
EC50/IC50
nM
koff
s-1
kon
M-1s-1
pHTemp
°C
Dipeptidase 1
(GUINEA PIG)
BDBM50042576
(5-Butyl-4-[2'-(1H-tetrazol-5-yl)-biphenyl-4-ylmeth...)
Show SMILES CCCCc1nn(c(C(O)=O)c1Cc1ccc(cc1)-c1ccccc1-c1nnn[nH]1)-c1c(Cl)cc(Cl)cc1Cl |(-2.96,-14.32,;-1.41,-14.32,;-.64,-13.02,;.92,-13.03,;1.82,-11.79,;1.36,-10.32,;2.6,-9.41,;3.84,-10.32,;5.31,-9.83,;5.63,-8.33,;6.79,-10.57,;3.37,-11.79,;4.27,-13.03,;5.81,-13.02,;6.57,-14.35,;8.11,-14.34,;8.86,-13.02,;8.09,-11.69,;6.56,-11.7,;10.41,-13,;11.18,-14.34,;12.71,-14.32,;13.48,-13,;12.69,-11.64,;11.16,-11.67,;10.63,-10.21,;11.87,-9.31,;11.4,-7.85,;9.86,-7.83,;9.38,-9.3,;2.2,-7.88,;3.31,-6.78,;4.76,-6.54,;2.91,-5.28,;1.4,-4.86,;.98,-3.34,;.29,-5.99,;.69,-7.47,;-.47,-8.57,)|
Show InChI InChI=1S/C28H23Cl3N6O2/c1-2-3-8-24-21(25(28(38)39)37(34-24)26-22(30)14-18(29)15-23(26)31)13-16-9-11-17(12-10-16)19-6-4-5-7-20(19)27-32-35-36-33-27/h4-7,9-12,14-15H,2-3,8,13H2,1H3,(H,38,39)(H,32,33,35,36)
8.00E+5n/an/an/an/an/an/an/an/a
Merck Research Laboratories
Curated by ChEMBL
Assay Description
In vitro apparent inhibition constant of porcine renal Dehydropeptidase-1.
Bioorg Med Chem Lett 9: 2741-6 (1999)
BindingDB Entry DOI: 10.7270/Q24Q7T6C
Type-1 angiotensin II receptor
(RABBIT)
BDBM50042576
(5-Butyl-4-[2'-(1H-tetrazol-5-yl)-biphenyl-4-ylmeth...)
Show SMILES CCCCc1nn(c(C(O)=O)c1Cc1ccc(cc1)-c1ccccc1-c1nnn[nH]1)-c1c(Cl)cc(Cl)cc1Cl |(-2.96,-14.32,;-1.41,-14.32,;-.64,-13.02,;.92,-13.03,;1.82,-11.79,;1.36,-10.32,;2.6,-9.41,;3.84,-10.32,;5.31,-9.83,;5.63,-8.33,;6.79,-10.57,;3.37,-11.79,;4.27,-13.03,;5.81,-13.02,;6.57,-14.35,;8.11,-14.34,;8.86,-13.02,;8.09,-11.69,;6.56,-11.7,;10.41,-13,;11.18,-14.34,;12.71,-14.32,;13.48,-13,;12.69,-11.64,;11.16,-11.67,;10.63,-10.21,;11.87,-9.31,;11.4,-7.85,;9.86,-7.83,;9.38,-9.3,;2.2,-7.88,;3.31,-6.78,;4.76,-6.54,;2.91,-5.28,;1.4,-4.86,;.98,-3.34,;.29,-5.99,;.69,-7.47,;-.47,-8.57,)|
Show InChI InChI=1S/C28H23Cl3N6O2/c1-2-3-8-24-21(25(28(38)39)37(34-24)26-22(30)14-18(29)15-23(26)31)13-16-9-11-17(12-10-16)19-6-4-5-7-20(19)27-32-35-36-33-27/h4-7,9-12,14-15H,2-3,8,13H2,1H3,(H,38,39)(H,32,33,35,36)
n/an/a 0.5n/an/an/an/an/an/a
Merck Research Laboratories
Curated by ChEMBL
Assay Description
Evaluation of Angiotensin II antagonistic activity by displacement of [125I]-Sar Ile-AII at the rabbit aorta Angiotensin II receptor, type 1
J Med Chem 36: 3595-605 (1994)
BindingDB Entry DOI: 10.7270/Q25Q4V5H
Metallo-beta-lactamase type 2
(Bacteroides fragilis)
BDBM50042576
(5-Butyl-4-[2'-(1H-tetrazol-5-yl)-biphenyl-4-ylmeth...)
Show SMILES CCCCc1nn(c(C(O)=O)c1Cc1ccc(cc1)-c1ccccc1-c1nnn[nH]1)-c1c(Cl)cc(Cl)cc1Cl |(-2.96,-14.32,;-1.41,-14.32,;-.64,-13.02,;.92,-13.03,;1.82,-11.79,;1.36,-10.32,;2.6,-9.41,;3.84,-10.32,;5.31,-9.83,;5.63,-8.33,;6.79,-10.57,;3.37,-11.79,;4.27,-13.03,;5.81,-13.02,;6.57,-14.35,;8.11,-14.34,;8.86,-13.02,;8.09,-11.69,;6.56,-11.7,;10.41,-13,;11.18,-14.34,;12.71,-14.32,;13.48,-13,;12.69,-11.64,;11.16,-11.67,;10.63,-10.21,;11.87,-9.31,;11.4,-7.85,;9.86,-7.83,;9.38,-9.3,;2.2,-7.88,;3.31,-6.78,;4.76,-6.54,;2.91,-5.28,;1.4,-4.86,;.98,-3.34,;.29,-5.99,;.69,-7.47,;-.47,-8.57,)|
Show InChI InChI=1S/C28H23Cl3N6O2/c1-2-3-8-24-21(25(28(38)39)37(34-24)26-22(30)14-18(29)15-23(26)31)13-16-9-11-17(12-10-16)19-6-4-5-7-20(19)27-32-35-36-33-27/h4-7,9-12,14-15H,2-3,8,13H2,1H3,(H,38,39)(H,32,33,35,36)
NCI pathway
Reactome pathway
n/an/a 3.30E+4n/an/an/an/an/an/a
Merck Research Laboratories
Curated by ChEMBL
Assay Description
Inhibition of metallo-beta-lactamase (MBL) from Bacteroides fragilis.
Bioorg Med Chem Lett 9: 2741-6 (1999)
BindingDB Entry DOI: 10.7270/Q24Q7T6C
Beta-lactamase
(Pseudomonas aeruginosa)
BDBM50042576
(5-Butyl-4-[2'-(1H-tetrazol-5-yl)-biphenyl-4-ylmeth...)
Show SMILES CCCCc1nn(c(C(O)=O)c1Cc1ccc(cc1)-c1ccccc1-c1nnn[nH]1)-c1c(Cl)cc(Cl)cc1Cl |(-2.96,-14.32,;-1.41,-14.32,;-.64,-13.02,;.92,-13.03,;1.82,-11.79,;1.36,-10.32,;2.6,-9.41,;3.84,-10.32,;5.31,-9.83,;5.63,-8.33,;6.79,-10.57,;3.37,-11.79,;4.27,-13.03,;5.81,-13.02,;6.57,-14.35,;8.11,-14.34,;8.86,-13.02,;8.09,-11.69,;6.56,-11.7,;10.41,-13,;11.18,-14.34,;12.71,-14.32,;13.48,-13,;12.69,-11.64,;11.16,-11.67,;10.63,-10.21,;11.87,-9.31,;11.4,-7.85,;9.86,-7.83,;9.38,-9.3,;2.2,-7.88,;3.31,-6.78,;4.76,-6.54,;2.91,-5.28,;1.4,-4.86,;.98,-3.34,;.29,-5.99,;.69,-7.47,;-.47,-8.57,)|
Show InChI InChI=1S/C28H23Cl3N6O2/c1-2-3-8-24-21(25(28(38)39)37(34-24)26-22(30)14-18(29)15-23(26)31)13-16-9-11-17(12-10-16)19-6-4-5-7-20(19)27-32-35-36-33-27/h4-7,9-12,14-15H,2-3,8,13H2,1H3,(H,38,39)(H,32,33,35,36)
n/an/a>2.00E+5n/an/an/an/an/an/a
Merck Research Laboratories
Curated by ChEMBL
Assay Description
Inhibition of metallo-beta-lactamase (MBL) from Pseudomonas aeruginosa mediated by the plasmid-borne IMP-1 enzyme.
Bioorg Med Chem Lett 9: 2741-6 (1999)
BindingDB Entry DOI: 10.7270/Q24Q7T6C