null
SMILES: CC(C)c1nc(c(-c2cccc(Cl)c2)n1\C=C\[C@@H](O)C[C@@H](O)CC([O-])=O)-c1ccc(F)cc1
InChI Key: InChIKey=FRHFGOPVPWQXEF-VRDGUJSXSA-M
Activity Spreadsheet -- Enzyme Inhibition Constant Data from BindingDB
Found 2 hits for monomerid = 50042643
Trg + Lig
Ki
nM
ΔG°
kcal/mole
IC50
nM
Kd
nM
EC50/IC50
nM
koff
s-1
kon
M-1s-1
pHTemp
°C
3-hydroxy-3-methylglutaryl-coenzyme A reductase
(Homo sapiens (Human))
BDBM50042643
((E)-(3R,5S)-7-[5-(3-Chloro-phenyl)-4-(4-fluoro-phe...)
Show SMILES CC(C)c1nc(c(-c2cccc(Cl)c2)n1\C=C\[C@@H](O)C[C@@H](O)CC([O-])=O)-c1ccc(F)cc1
Show InChI InChI=1S/C25H26ClFN2O4/c1-15(2)25-28-23(16-6-8-19(27)9-7-16)24(17-4-3-5-18(26)12-17)29(25)11-10-20(30)13-21(31)14-22(32)33/h3-12,15,20-21,30-31H,13-14H2,1-2H3,(H,32,33)/p-1/b11-10+/t20-,21-/m1/s1
n/an/a 8.10n/an/an/an/an/an/a
National Institute of Pharmaceutical Education and Research (NIPER)
Curated by ChEMBL
Assay Description
Inhibitory concentration against 3-hydroxy-3-methylglutaryl-CoA reductase
Bioorg Med Chem Lett 15: 1027-32 (2005)
Article DOI: 10.1016/j.bmcl.2004.12.042
BindingDB Entry DOI: 10.7270/Q2TB17N9
3-hydroxy-3-methylglutaryl-coenzyme A reductase
(Rattus norvegicus (rat))
BDBM50042643
((E)-(3R,5S)-7-[5-(3-Chloro-phenyl)-4-(4-fluoro-phe...)
Show SMILES CC(C)c1nc(c(-c2cccc(Cl)c2)n1\C=C\[C@@H](O)C[C@@H](O)CC([O-])=O)-c1ccc(F)cc1
Show InChI InChI=1S/C25H26ClFN2O4/c1-15(2)25-28-23(16-6-8-19(27)9-7-16)24(17-4-3-5-18(26)12-17)29(25)11-10-20(30)13-21(31)14-22(32)33/h3-12,15,20-21,30-31H,13-14H2,1-2H3,(H,32,33)/p-1/b11-10+/t20-,21-/m1/s1
Reactome pathway
n/an/a 8n/an/an/an/an/an/a
Glaxo Group Research Ltd.
Curated by ChEMBL
Assay Description
Inhibitory activity against washed rat liver microsomal HMG-CoA reductase (HMGR)
J Med Chem 36: 3646-57 (1994)
BindingDB Entry DOI: 10.7270/Q2X929CH