BDBM50042654 7-[3-(3-Bromo-phenyl)-2-(4-fluoro-phenyl)-5-isopropyl-pyrrol-1-yl]-3,5-dihydroxy-hept-6-enoic acid methyl ester::CHEMBL119609
SMILES: COC(=O)C[C@H](O)C[C@H](O)\C=C\n1c(cc(c1-c1ccc(F)cc1)-c1cccc(Br)c1)C(C)C
InChI Key: InChIKey=DBEXGLZBTDQPGD-IJIRNXSHSA-N
Data: 1 IC50
Activity Spreadsheet -- Enzyme Inhibition Constant Data from BindingDB
Found 1 hit for monomerid = 50042654
Trg + Lig
Ki
nM
ΔG°
kcal/mole
IC50
nM
Kd
nM
EC50/IC50
nM
koff
s-1
kon
M-1s-1
pHTemp
°C
HMG-CoA reductase
(Rattus norvegicus (rat))
BDBM50042654
(7-[3-(3-Bromo-phenyl)-2-(4-fluoro-phenyl)-5-isopro...)
Show SMILES COC(=O)C[C@H](O)C[C@H](O)\C=C\n1c(cc(c1-c1ccc(F)cc1)-c1cccc(Br)c1)C(C)C
Show InChI InChI=1S/C27H29BrFNO4/c1-17(2)25-16-24(19-5-4-6-20(28)13-19)27(18-7-9-21(29)10-8-18)30(25)12-11-22(31)14-23(32)15-26(33)34-3/h4-13,16-17,22-23,31-32H,14-15H2,1-3H3/b12-11+/t22-,23-/m1/s1
Reactome pathway
n/an/a 0.5n/an/an/an/an/an/a
Glaxo Group Research Ltd.
Curated by ChEMBL
Assay Description
Inhibition of rat liver microsomal HMG-CoA reductase
J Med Chem 36: 3658-62 (1994)
BindingDB Entry DOI: 10.7270/Q2SJ1JP7