BDBM50042800 2-Amino-7-cyclohexylmethyl-3,5-dihydro-pyrrolo[3,2-d]pyrimidin-4-one::CHEMBL299952
SMILES: Nc1nc2c(CC3CCCCC3)c[nH]c2c(=O)[nH]1
InChI Key: InChIKey=ZEWVUZXPYBZKSJ-UHFFFAOYSA-N
Data: 2 KI  5 IC50
Activity Spreadsheet -- Enzyme Inhibition Constant Data from BindingDB
Found 7 hits for monomerid = 50042800
Trg + Lig
Ki
nM
ΔG°
kcal/mole
IC50
nM
Kd
nM
EC50/IC50
nM
koff
s-1
kon
M-1s-1
pHTemp
°C
Purine Nucleoside Phosphorylase (PNP)
(Bos taurus (bovine))
BDBM50042800
(2-Amino-7-cyclohexylmethyl-3,5-dihydro-pyrrolo[3,2...)
Show SMILES Nc1nc2c(CC3CCCCC3)c[nH]c2c(=O)[nH]1
Show InChI InChI=1S/C13H18N4O/c14-13-16-10-9(6-8-4-2-1-3-5-8)7-15-11(10)12(18)17-13/h7-8,15H,1-6H2,(H3,14,16,17,18)
Reactome pathway
6.40n/an/an/an/an/an/an/an/a
University of Michigan
Curated by ChEMBL
Assay Description
Inhibitory activity against calf spleen purine nucleoside phosphorylase (PNP) using 2-amino-6-mercapto-7-methyl purine ribonucleoside (MESG) as subst...
J Med Chem 42: 2422-31 (1999)
Article DOI: 10.1021/jm990037y
BindingDB Entry DOI: 10.7270/Q2CR5SKN
Purine Nucleoside Phosphorylase (PNP)
(Bos taurus (bovine))
BDBM50042800
(2-Amino-7-cyclohexylmethyl-3,5-dihydro-pyrrolo[3,2...)
Show SMILES Nc1nc2c(CC3CCCCC3)c[nH]c2c(=O)[nH]1
Show InChI InChI=1S/C13H18N4O/c14-13-16-10-9(6-8-4-2-1-3-5-8)7-15-11(10)12(18)17-13/h7-8,15H,1-6H2,(H3,14,16,17,18)
Reactome pathway
13.2n/an/an/an/an/an/an/an/a
University of Michigan
Curated by ChEMBL
Assay Description
Inhibitory activity against calf spleen purine nucleoside phosphorylase (PNP) using inosine as substrate at a concentration of 10 uM.
J Med Chem 42: 2422-31 (1999)
Article DOI: 10.1021/jm990037y
BindingDB Entry DOI: 10.7270/Q2CR5SKN
Purine nucleoside phosphorylase
(Homo sapiens (Human))
BDBM50042800
(2-Amino-7-cyclohexylmethyl-3,5-dihydro-pyrrolo[3,2...)
Show SMILES Nc1nc2c(CC3CCCCC3)c[nH]c2c(=O)[nH]1
Show InChI InChI=1S/C13H18N4O/c14-13-16-10-9(6-8-4-2-1-3-5-8)7-15-11(10)12(18)17-13/h7-8,15H,1-6H2,(H3,14,16,17,18)
Reactome pathway
n/an/a 2.10E+3n/an/an/an/an/an/a
BioCryst Pharmaceuticals, Inc.
Curated by ChEMBL
Assay Description
Inhibition of Purine nucleoside Phosphorylase from calf spleen at 50 mM PO4
J Med Chem 36: 3771-83 (1994)
BindingDB Entry DOI: 10.7270/Q23J3DKS
Purine nucleoside phosphorylase
(Bos taurus (bovine))
BDBM50042800
(2-Amino-7-cyclohexylmethyl-3,5-dihydro-pyrrolo[3,2...)
Show SMILES Nc1nc2c(CC3CCCCC3)c[nH]c2c(=O)[nH]1
Show InChI InChI=1S/C13H18N4O/c14-13-16-10-9(6-8-4-2-1-3-5-8)7-15-11(10)12(18)17-13/h7-8,15H,1-6H2,(H3,14,16,17,18)
Reactome pathway
n/an/a 2.10E+3n/an/an/an/an/an/a
BioCryst Pharmaceuticals, Inc.
Curated by ChEMBL
Assay Description
Inhibition of purine nucleoside phosphorylase from calf spleen in 50 mM phosphate
J Med Chem 36: 1847-54 (1993)
BindingDB Entry DOI: 10.7270/Q2WQ02WD
Purine Nucleoside Phosphorylase (PNP)
(Bos taurus (bovine))
BDBM50042800
(2-Amino-7-cyclohexylmethyl-3,5-dihydro-pyrrolo[3,2...)
Show SMILES Nc1nc2c(CC3CCCCC3)c[nH]c2c(=O)[nH]1
Show InChI InChI=1S/C13H18N4O/c14-13-16-10-9(6-8-4-2-1-3-5-8)7-15-11(10)12(18)17-13/h7-8,15H,1-6H2,(H3,14,16,17,18)
Reactome pathway
n/an/a 21n/an/an/an/an/an/a
University of Michigan
Curated by ChEMBL
Assay Description
Inhibitory activity against calf spleen purine nucleoside phosphorylase (PNP) using inosine as substrate at a concentration of 10 uM.
J Med Chem 42: 2422-31 (1999)
Article DOI: 10.1021/jm990037y
BindingDB Entry DOI: 10.7270/Q2CR5SKN
Purine Nucleoside Phosphorylase (PNP)
(Bos taurus (bovine))
BDBM50042800
(2-Amino-7-cyclohexylmethyl-3,5-dihydro-pyrrolo[3,2...)
Show SMILES Nc1nc2c(CC3CCCCC3)c[nH]c2c(=O)[nH]1
Show InChI InChI=1S/C13H18N4O/c14-13-16-10-9(6-8-4-2-1-3-5-8)7-15-11(10)12(18)17-13/h7-8,15H,1-6H2,(H3,14,16,17,18)
Reactome pathway
n/an/a 47n/an/an/an/an/an/a
BioCryst Pharmaceuticals, Inc.
Curated by ChEMBL
Assay Description
In vitro inhibition of purine nucleoside phosphorylase from calf spleen in 1 mM phosphate
J Med Chem 36: 1847-54 (1993)
BindingDB Entry DOI: 10.7270/Q2WQ02WD
Purine nucleoside phosphorylase
(Homo sapiens (Human))
BDBM50042800
(2-Amino-7-cyclohexylmethyl-3,5-dihydro-pyrrolo[3,2...)
Show SMILES Nc1nc2c(CC3CCCCC3)c[nH]c2c(=O)[nH]1
Show InChI InChI=1S/C13H18N4O/c14-13-16-10-9(6-8-4-2-1-3-5-8)7-15-11(10)12(18)17-13/h7-8,15H,1-6H2,(H3,14,16,17,18)
Reactome pathway
n/an/a 47n/an/an/an/an/an/a
BioCryst Pharmaceuticals, Inc.
Curated by ChEMBL
Assay Description
Inhibition of Purine nucleoside Phosphorylase from calf spleen at 1 mM PO4
J Med Chem 36: 3771-83 (1994)
BindingDB Entry DOI: 10.7270/Q23J3DKS