BDBM50042838 6-Mercaptomethyl-5-oxo-1-thia-4-aza-cyclotridecane-3-carboxylic acid::CHEMBL340454
SMILES: OC(=O)[C@@H]1CSCCCCCCCC(CS)C(=O)N1
InChI Key: InChIKey=IEXLNMCXTFFDIL-DTIOYNMSSA-N
Data: 4 IC50
Activity Spreadsheet -- Enzyme Inhibition Constant Data from BindingDB
Found 4 hits for monomerid = 50042838
Trg + Lig
Ki
nM
ΔG°
kcal/mole
IC50
nM
Kd
nM
EC50/IC50
nM
koff
s-1
kon
M-1s-1
pHTemp
°C
Angiotensin-converting enzyme
(Oryctolagus cuniculus)
BDBM50042838
(6-Mercaptomethyl-5-oxo-1-thia-4-aza-cyclotridecane...)
Show SMILES OC(=O)[C@@H]1CSCCCCCCCC(CS)C(=O)N1
Show InChI InChI=1S/C13H23NO3S2/c15-12-10(8-18)6-4-2-1-3-5-7-19-9-11(14-12)13(16)17/h10-11,18H,1-9H2,(H,14,15)(H,16,17)/t10?,11-/m0/s1
n/an/a 12n/an/an/an/an/an/a
CIBA-GEIGY Corporation
Curated by ChEMBL
Assay Description
Tested in vitro for the inhibition of angiotensin converting enzyme from rabbit lung
J Med Chem 36: 3829-33 (1994)
BindingDB Entry DOI: 10.7270/Q2125RRG
Angiotensin-converting enzyme
(Oryctolagus cuniculus)
BDBM50042838
(6-Mercaptomethyl-5-oxo-1-thia-4-aza-cyclotridecane...)
Show SMILES OC(=O)[C@@H]1CSCCCCCCCC(CS)C(=O)N1
Show InChI InChI=1S/C13H23NO3S2/c15-12-10(8-18)6-4-2-1-3-5-7-19-9-11(14-12)13(16)17/h10-11,18H,1-9H2,(H,14,15)(H,16,17)/t10?,11-/m0/s1
n/an/a 72n/an/an/an/an/an/a
CIBA-GEIGY Corporation
Curated by ChEMBL
Assay Description
Tested in vitro for the inhibition of angiotensin converting enzyme from rabbit lung
J Med Chem 36: 3829-33 (1994)
BindingDB Entry DOI: 10.7270/Q2125RRG
Neprilysin
(Rattus norvegicus (Rat))
BDBM50042838
(6-Mercaptomethyl-5-oxo-1-thia-4-aza-cyclotridecane...)
Show SMILES OC(=O)[C@@H]1CSCCCCCCCC(CS)C(=O)N1
Show InChI InChI=1S/C13H23NO3S2/c15-12-10(8-18)6-4-2-1-3-5-7-19-9-11(14-12)13(16)17/h10-11,18H,1-9H2,(H,14,15)(H,16,17)/t10?,11-/m0/s1
Reactome pathway
n/an/a 18n/an/an/an/an/an/a
CIBA-GEIGY Corporation
Curated by ChEMBL
Assay Description
Tested in vitro for the inhibition against angiotensin converting enzyme (ACE) from rabbit lung
J Med Chem 36: 3829-33 (1994)
BindingDB Entry DOI: 10.7270/Q2125RRG
Neutral Endopeptidase (NEP)
(Rattus norvegicus (Rat))
BDBM50042838
(6-Mercaptomethyl-5-oxo-1-thia-4-aza-cyclotridecane...)
Show SMILES OC(=O)[C@@H]1CSCCCCCCCC(CS)C(=O)N1
Show InChI InChI=1S/C13H23NO3S2/c15-12-10(8-18)6-4-2-1-3-5-7-19-9-11(14-12)13(16)17/h10-11,18H,1-9H2,(H,14,15)(H,16,17)/t10?,11-/m0/s1
Reactome pathway
n/an/a 190n/an/an/an/an/an/a
CIBA-GEIGY Corporation
Curated by ChEMBL
Assay Description
Tested in vitro for the inhibition against neutral endopeptidase (NEP) from rat kidney
J Med Chem 36: 3829-33 (1994)
BindingDB Entry DOI: 10.7270/Q2125RRG