BDBM50042890 CHEMBL3354538
SMILES: CC(C)(C)c1cc(NC(=O)[C@@H]2CCCCN2C(=O)c2ccccc2)no1
InChI Key: InChIKey=GDISNQGQVSLPNH-HNNXBMFYSA-N
Data: 2 EC50
Activity Spreadsheet -- Enzyme Inhibition Constant Data from BindingDB
Found 2 hits for monomerid = 50042890
Trg + Lig
Ki
nM
ΔG°
kcal/mole
IC50
nM
Kd
nM
EC50/IC50
nM
koff
s-1
kon
M-1s-1
pHTemp
°C
Cannabinoid receptor 2
(Homo sapiens (Human))
BDBM50042890
(CHEMBL3354538)
Show SMILES CC(C)(C)c1cc(NC(=O)[C@@H]2CCCCN2C(=O)c2ccccc2)no1 |r|
Show InChI InChI=1S/C20H25N3O3/c1-20(2,3)16-13-17(22-26-16)21-18(24)15-11-7-8-12-23(15)19(25)14-9-5-4-6-10-14/h4-6,9-10,13,15H,7-8,11-12H2,1-3H3,(H,21,22,24)/t15-/m0/s1
Reactome pathway
n/an/an/an/a 19n/an/an/an/a
Boehringer Ingelheim Pharmaceuticals
Curated by ChEMBL
Assay Description
Agonist activity at human recombinant CB2 receptor expressing CHO cells assessed as inhibition of forskolin-induced cAMP accumulation incubated for 3...
Bioorg Med Chem Lett 25: 587-92 (2015)
Article DOI: 10.1016/j.bmcl.2014.12.031
BindingDB Entry DOI: 10.7270/Q2QZ2CM5
Cannabinoid receptor 1
(Homo sapiens (Human))
BDBM50042890
(CHEMBL3354538)
Show SMILES CC(C)(C)c1cc(NC(=O)[C@@H]2CCCCN2C(=O)c2ccccc2)no1 |r|
Show InChI InChI=1S/C20H25N3O3/c1-20(2,3)16-13-17(22-26-16)21-18(24)15-11-7-8-12-23(15)19(25)14-9-5-4-6-10-14/h4-6,9-10,13,15H,7-8,11-12H2,1-3H3,(H,21,22,24)/t15-/m0/s1
NCI pathway
Reactome pathway
n/an/an/an/a>2.00E+4n/an/an/an/a
Boehringer Ingelheim Pharmaceuticals
Curated by ChEMBL
Assay Description
Agonist activity at human recombinant CB1 receptor expressing CHO cells assessed as inhibition of forskolin-induced cAMP accumulation incubated for 3...
Bioorg Med Chem Lett 25: 587-92 (2015)
Article DOI: 10.1016/j.bmcl.2014.12.031
BindingDB Entry DOI: 10.7270/Q2QZ2CM5