BDBM50042907 CHEMBL3354558
SMILES: O=C(Nc1cc(no1)-c1ccccc1)[C@@H]1CCCCN1C(=O)N1CCS(=O)(=O)CC1
InChI Key: InChIKey=OYEPUYFAWQHKHJ-KRWDZBQOSA-N
Data: 2 EC50
Activity Spreadsheet -- Enzyme Inhibition Constant Data from BindingDB
Found 2 hits for monomerid = 50042907
Trg + Lig
Ki
nM
ΔG°
kcal/mole
IC50
nM
Kd
nM
EC50/IC50
nM
koff
s-1
kon
M-1s-1
pHTemp
°C
Cannabinoid receptor 1
(Homo sapiens (Human))
BDBM50042907
(CHEMBL3354558)
Show SMILES O=C(Nc1cc(no1)-c1ccccc1)[C@@H]1CCCCN1C(=O)N1CCS(=O)(=O)CC1 |r|
Show InChI InChI=1S/C20H24N4O5S/c25-19(21-18-14-16(22-29-18)15-6-2-1-3-7-15)17-8-4-5-9-24(17)20(26)23-10-12-30(27,28)13-11-23/h1-3,6-7,14,17H,4-5,8-13H2,(H,21,25)/t17-/m0/s1
NCI pathway
Reactome pathway
n/an/an/an/a>2.00E+4n/an/an/an/a
Boehringer Ingelheim Pharmaceuticals
Curated by ChEMBL
Assay Description
Agonist activity at human recombinant CB1 receptor expressing CHO cells assessed as inhibition of forskolin-induced cAMP accumulation incubated for 3...
Bioorg Med Chem Lett 25: 587-92 (2015)
Article DOI: 10.1016/j.bmcl.2014.12.031
BindingDB Entry DOI: 10.7270/Q2QZ2CM5
Cannabinoid receptor 2
(Homo sapiens (Human))
BDBM50042907
(CHEMBL3354558)
Show SMILES O=C(Nc1cc(no1)-c1ccccc1)[C@@H]1CCCCN1C(=O)N1CCS(=O)(=O)CC1 |r|
Show InChI InChI=1S/C20H24N4O5S/c25-19(21-18-14-16(22-29-18)15-6-2-1-3-7-15)17-8-4-5-9-24(17)20(26)23-10-12-30(27,28)13-11-23/h1-3,6-7,14,17H,4-5,8-13H2,(H,21,25)/t17-/m0/s1
Reactome pathway
n/an/an/an/a>1.00E+3n/an/an/an/a
Boehringer Ingelheim Pharmaceuticals
Curated by ChEMBL
Assay Description
Agonist activity at human recombinant CB2 receptor expressing CHO cells assessed as inhibition of forskolin-induced cAMP accumulation incubated for 3...
Bioorg Med Chem Lett 25: 587-92 (2015)
Article DOI: 10.1016/j.bmcl.2014.12.031
BindingDB Entry DOI: 10.7270/Q2QZ2CM5