BDBM50042919 CHEMBL3354546
SMILES: CC(C)(C)c1cc(NC(=O)[C@@H]2CCCCN2C(=O)N2CCCCC2)no1
InChI Key: InChIKey=MLWBJAJPKGWDSO-AWEZNQCLSA-N
Data: 2 EC50
Activity Spreadsheet -- Enzyme Inhibition Constant Data from BindingDB
Found 2 hits for monomerid = 50042919
Trg + Lig
Ki
nM
ΔG°
kcal/mole
IC50
nM
Kd
nM
EC50/IC50
nM
koff
s-1
kon
M-1s-1
pHTemp
°C
Cannabinoid receptor 1
(Homo sapiens (Human))
BDBM50042919
(CHEMBL3354546)
Show SMILES CC(C)(C)c1cc(NC(=O)[C@@H]2CCCCN2C(=O)N2CCCCC2)no1 |r|
Show InChI InChI=1S/C19H30N4O3/c1-19(2,3)15-13-16(21-26-15)20-17(24)14-9-5-8-12-23(14)18(25)22-10-6-4-7-11-22/h13-14H,4-12H2,1-3H3,(H,20,21,24)/t14-/m0/s1
NCI pathway
Reactome pathway
n/an/an/an/a>2.00E+4n/an/an/an/a
Boehringer Ingelheim Pharmaceuticals
Curated by ChEMBL
Assay Description
Agonist activity at human recombinant CB1 receptor expressing CHO cells assessed as inhibition of forskolin-induced cAMP accumulation incubated for 3...
Bioorg Med Chem Lett 25: 587-92 (2015)
Article DOI: 10.1016/j.bmcl.2014.12.031
BindingDB Entry DOI: 10.7270/Q2QZ2CM5
Cannabinoid receptor 2
(Homo sapiens (Human))
BDBM50042919
(CHEMBL3354546)
Show SMILES CC(C)(C)c1cc(NC(=O)[C@@H]2CCCCN2C(=O)N2CCCCC2)no1 |r|
Show InChI InChI=1S/C19H30N4O3/c1-19(2,3)15-13-16(21-26-15)20-17(24)14-9-5-8-12-23(14)18(25)22-10-6-4-7-11-22/h13-14H,4-12H2,1-3H3,(H,20,21,24)/t14-/m0/s1
Reactome pathway
n/an/an/an/a 61n/an/an/an/a
Boehringer Ingelheim Pharmaceuticals
Curated by ChEMBL
Assay Description
Agonist activity at human recombinant CB2 receptor expressing CHO cells assessed as inhibition of forskolin-induced cAMP accumulation incubated for 3...
Bioorg Med Chem Lett 25: 587-92 (2015)
Article DOI: 10.1016/j.bmcl.2014.12.031
BindingDB Entry DOI: 10.7270/Q2QZ2CM5