BDBM50043327 2-Hydroxy-5-(2-hydroxy-benzylamino)-benzoic acid methyl ester::CHEMBL132907
SMILES: COC(=O)c1cc(NCc2ccccc2O)ccc1O
InChI Key: InChIKey=GIAGGFBJOMQPDM-UHFFFAOYSA-N
Data: 2 IC50
Activity Spreadsheet -- Enzyme Inhibition Constant Data from BindingDB
Found 2 hits for monomerid = 50043327
Trg + Lig
Ki
nM
ΔG°
kcal/mole
IC50
nM
Kd
nM
EC50/IC50
nM
koff
s-1
kon
M-1s-1
pHTemp
°C
NADPH oxidase 4
(Homo sapiens (Human))
BDBM50043327
(2-Hydroxy-5-(2-hydroxy-benzylamino)-benzoic acid m...)
Show SMILES COC(=O)c1cc(NCc2ccccc2O)ccc1O
Show InChI InChI=1S/C15H15NO4/c1-20-15(19)12-8-11(6-7-14(12)18)16-9-10-4-2-3-5-13(10)17/h2-8,16-18H,9H2,1H3
n/an/a 1.27E+3n/an/an/an/an/an/a
Vichem Chemie Research Ltd.
Curated by ChEMBL
Assay Description
Inhibition of NOX4 expressed in HEK293 FS cells assessed as H2O2 production by H2O2/Tyr/LPO assay
J Med Chem 53: 6758-62 (2010)
Article DOI: 10.1021/jm1004368
BindingDB Entry DOI: 10.7270/Q2F18ZZ5
Epidermal growth factor receptor
(Homo sapiens (Human))
BDBM50043327
(2-Hydroxy-5-(2-hydroxy-benzylamino)-benzoic acid m...)
Show SMILES COC(=O)c1cc(NCc2ccccc2O)ccc1O
Show InChI InChI=1S/C15H15NO4/c1-20-15(19)12-8-11(6-7-14(12)18)16-9-10-4-2-3-5-13(10)17/h2-8,16-18H,9H2,1H3
n/an/a 2.00E+4n/an/an/an/an/an/a
INSERM
Curated by ChEMBL
Assay Description
Inhibition of EGF-dependent DNA synthesis in ER 22 cells incubated with [3H]-TdR
J Med Chem 36: 4094-8 (1994)
BindingDB Entry DOI: 10.7270/Q2KS6QMV