BDBM50043345 CHEMBL3355056
SMILES: NCCCOc1cc(ccc1C(=O)Nc1ccccc1)-c1cn[nH]c1
InChI Key: InChIKey=KLMWPYHIMXLJIE-UHFFFAOYSA-N
Data: 1 IC50
Activity Spreadsheet -- Enzyme Inhibition Constant Data from BindingDB
Found 1 hit for monomerid = 50043345
Trg + Lig
Ki
nM
ΔG°
kcal/mole
IC50
nM
Kd
nM
EC50/IC50
nM
koff
s-1
kon
M-1s-1
pHTemp
°C
Maternal embryonic leucine zipper kinase (MELK)
(Homo sapiens (Human))
BDBM50043345
(CHEMBL3355056)
Show SMILES NCCCOc1cc(ccc1C(=O)Nc1ccccc1)-c1cn[nH]c1
Show InChI InChI=1S/C19H20N4O2/c20-9-4-10-25-18-11-14(15-12-21-22-13-15)7-8-17(18)19(24)23-16-5-2-1-3-6-16/h1-3,5-8,11-13H,4,9-10,20H2,(H,21,22)(H,23,24)
n/an/a 1.00E+3n/an/an/an/an/an/a
Astex Pharmaceuticals
Curated by ChEMBL
Assay Description
Inhibition of MELK kinase (unknown origin) using biotinylated ZIP-tide peptide/gamma[33P]ATP by scintillation counting analysis
ACS Med Chem Lett 6: 25-30 (2015)
Article DOI: 10.1021/ml5001245
BindingDB Entry DOI: 10.7270/Q29P3388