BDBM50043363 1,8-Dihydroxy-10-[3-(4-hydroxy-phenyl)-propionyl]-10H-anthracen-9-one::CHEMBL132621
SMILES: Oc1ccc(CCC(=O)C2c3cccc(O)c3C(=O)c3c(O)cccc23)cc1
InChI Key: InChIKey=BXBHHHFQVYLVCG-UHFFFAOYSA-N
Data: 1 IC50
Activity Spreadsheet -- Enzyme Inhibition Constant Data from BindingDB
Found 1 hit for monomerid = 50043363
Trg + Lig
Ki
nM
ΔG°
kcal/mole
IC50
nM
Kd
nM
EC50/IC50
nM
koff
s-1
kon
M-1s-1
pHTemp
°C
Arachidonate 5-lipoxygenase
(Bos taurus)
BDBM50043363
(1,8-Dihydroxy-10-[3-(4-hydroxy-phenyl)-propionyl]-...)
Show SMILES Oc1ccc(CCC(=O)C2c3cccc(O)c3C(=O)c3c(O)cccc23)cc1
Show InChI InChI=1S/C23H18O5/c24-14-10-7-13(8-11-14)9-12-19(27)20-15-3-1-5-17(25)21(15)23(28)22-16(20)4-2-6-18(22)26/h1-8,10-11,20,24-26H,9,12H2
Reactome pathway
n/an/a 1.00E+3n/an/an/an/an/an/a
Universität Regensburg
Curated by ChEMBL
Assay Description
Inhibitory activity against 5-lipoxygenase (inhibition of 5-HETE and LTB4 biosynthesis) in bovine polymorphonuclear leukocytes (PMNL).
J Med Chem 36: 4099-107 (1994)
BindingDB Entry DOI: 10.7270/Q2G44PC2