BDBM50043605 9a,11a-Dimethyl-7-oxo-2,3,3a,3b,4,5,7,8,9,9a,9b,10,11,11a-tetradecahydro-1H-cyclopenta[i]phenanthridine-1-carboxylic acid dibenzylamide::CHEMBL436215
SMILES: C[C@]12CCC3C(CN=C4CC(=O)CC[C@]34C)C1CC[C@@H]2C(=O)N(Cc1ccccc1)Cc1ccccc1
InChI Key: InChIKey=JYSDDBOKUDNZFU-GWCRSQLKSA-N
Data: 1 KI  1 IC50
Activity Spreadsheet -- Enzyme Inhibition Constant Data from BindingDB
Found 2 hits for monomerid = 50043605
Trg + Lig
Ki
nM
ΔG°
kcal/mole
IC50
nM
Kd
nM
EC50/IC50
nM
koff
s-1
kon
M-1s-1
pHTemp
°C
5α-Reductase 1 (5α-R1)
(Homo sapiens (Human))
BDBM50043605
(9a,11a-Dimethyl-7-oxo-2,3,3a,3b,4,5,7,8,9,9a,9b,10...)
Show SMILES C[C@]12CCC3C(CN=C4CC(=O)CC[C@]34C)C1CC[C@@H]2C(=O)N(Cc1ccccc1)Cc1ccccc1 |t:7|
Show InChI InChI=1S/C33H40N2O2/c1-32-18-16-28-26(20-34-30-19-25(36)15-17-33(28,30)2)27(32)13-14-29(32)31(37)35(21-23-9-5-3-6-10-23)22-24-11-7-4-8-12-24/h3-12,26-29H,13-22H2,1-2H3/t26?,27?,28?,29-,32+,33-/m1/s1
75n/an/an/an/an/an/an/an/a
Glaxo Inc. Research Institute
Curated by ChEMBL
Assay Description
Inhibition of recombinant human 5-alpha reductase-1 at a concentration of 5 microL after preincubation for 10 minutes
J Med Chem 36: 4313-5 (1994)
BindingDB Entry DOI: 10.7270/Q2PK0F76
Steroid 5-alpha-reductase
(Homo sapiens (Human))
BDBM50043605
(9a,11a-Dimethyl-7-oxo-2,3,3a,3b,4,5,7,8,9,9a,9b,10...)
Show SMILES C[C@]12CCC3C(CN=C4CC(=O)CC[C@]34C)C1CC[C@@H]2C(=O)N(Cc1ccccc1)Cc1ccccc1 |t:7|
Show InChI InChI=1S/C33H40N2O2/c1-32-18-16-28-26(20-34-30-19-25(36)15-17-33(28,30)2)27(32)13-14-29(32)31(37)35(21-23-9-5-3-6-10-23)22-24-11-7-4-8-12-24/h3-12,26-29H,13-22H2,1-2H3/t26?,27?,28?,29-,32+,33-/m1/s1
Reactome pathway
n/an/a 0.130n/an/an/an/an/an/a
Glaxo Inc. Research Institute
Curated by ChEMBL
Assay Description
Inhibition of recombinant human 5-alpha reductase-2 at a concentration of 5 microL after preincubation for 10 minutes
J Med Chem 36: 4313-5 (1994)
BindingDB Entry DOI: 10.7270/Q2PK0F76