BDBM50043607 1-(Adamantane-2-carbonyl)-9a,11a-dimethyl-1,2,3,3a,3b,4,5,8,9,9a,9b,10,11,11a-tetradecahydro-cyclopenta[i]phenanthridin-7-one::CHEMBL138173
SMILES: C[C@]12CCC3C(CN=C4CC(=O)CC[C@]34C)C1CC[C@@H]2C(=O)C1[C@H]2C[C@@H]3C[C@@H](C[C@H]1C3)C2
InChI Key: InChIKey=BPNDIWXPDDTRIY-REHKDQSCSA-N
Data: 1 KI  1 IC50
Activity Spreadsheet -- Enzyme Inhibition Constant Data from BindingDB
Found 2 hits for monomerid = 50043607
Trg + Lig
Ki
nM
ΔG°
kcal/mole
IC50
nM
Kd
nM
EC50/IC50
nM
koff
s-1
kon
M-1s-1
pHTemp
°C
5α-Reductase 1 (5α-R1)
(Homo sapiens (Human))
BDBM50043607
(1-(Adamantane-2-carbonyl)-9a,11a-dimethyl-1,2,3,3a...)
Show SMILES C[C@]12CCC3C(CN=C4CC(=O)CC[C@]34C)C1CC[C@@H]2C(=O)C1[C@H]2C[C@@H]3C[C@@H](C[C@H]1C3)C2 |wU:19.23,27.31,1.0,14.16,wD:25.35,29.32,23.27,t:7,THB:28:27:24:22.29.30,26:27:22:25.24.30,26:25:22:27.28.31,(3.55,-4.37,;3.55,-5.91,;2.22,-5.13,;.87,-5.89,;.85,-7.43,;2.18,-8.22,;2.18,-9.75,;.85,-10.51,;-.48,-9.74,;-1.81,-10.51,;-3.13,-9.74,;-4.47,-10.51,;-3.13,-8.2,;-1.81,-7.43,;-.48,-8.2,;-.48,-6.66,;3.52,-7.47,;4.98,-7.96,;5.91,-6.73,;5.02,-5.47,;5.51,-4,;4.49,-2.85,;7.03,-3.69,;7.68,-2.32,;9.26,-2.41,;10.44,-3.52,;10.04,-2.15,;8.55,-2.06,;7.98,-3.37,;8.24,-4.78,;9.78,-4.88,;7.35,-.8,)|
Show InChI InChI=1S/C29H41NO2/c1-28-8-6-23-21(15-30-25-14-20(31)5-7-29(23,25)2)22(28)3-4-24(28)27(32)26-18-10-16-9-17(12-18)13-19(26)11-16/h16-19,21-24,26H,3-15H2,1-2H3/t16-,17+,18-,19+,21?,22?,23?,24-,26?,28+,29-/m1/s1
6.90n/an/an/an/an/an/an/an/a
Glaxo Inc. Research Institute
Curated by ChEMBL
Assay Description
Inhibition of recombinant human 5-alpha reductase-1 at a concentration of 5 microL after preincubation for 10 minutes
J Med Chem 36: 4313-5 (1994)
BindingDB Entry DOI: 10.7270/Q2PK0F76
Steroid 5-alpha-reductase
(Homo sapiens (Human))
BDBM50043607
(1-(Adamantane-2-carbonyl)-9a,11a-dimethyl-1,2,3,3a...)
Show SMILES C[C@]12CCC3C(CN=C4CC(=O)CC[C@]34C)C1CC[C@@H]2C(=O)C1[C@H]2C[C@@H]3C[C@@H](C[C@H]1C3)C2 |wU:19.23,27.31,1.0,14.16,wD:25.35,29.32,23.27,t:7,THB:28:27:24:22.29.30,26:27:22:25.24.30,26:25:22:27.28.31,(3.55,-4.37,;3.55,-5.91,;2.22,-5.13,;.87,-5.89,;.85,-7.43,;2.18,-8.22,;2.18,-9.75,;.85,-10.51,;-.48,-9.74,;-1.81,-10.51,;-3.13,-9.74,;-4.47,-10.51,;-3.13,-8.2,;-1.81,-7.43,;-.48,-8.2,;-.48,-6.66,;3.52,-7.47,;4.98,-7.96,;5.91,-6.73,;5.02,-5.47,;5.51,-4,;4.49,-2.85,;7.03,-3.69,;7.68,-2.32,;9.26,-2.41,;10.44,-3.52,;10.04,-2.15,;8.55,-2.06,;7.98,-3.37,;8.24,-4.78,;9.78,-4.88,;7.35,-.8,)|
Show InChI InChI=1S/C29H41NO2/c1-28-8-6-23-21(15-30-25-14-20(31)5-7-29(23,25)2)22(28)3-4-24(28)27(32)26-18-10-16-9-17(12-18)13-19(26)11-16/h16-19,21-24,26H,3-15H2,1-2H3/t16-,17+,18-,19+,21?,22?,23?,24-,26?,28+,29-/m1/s1
Reactome pathway
n/an/a 0.0400n/an/an/an/an/an/a
Glaxo Inc. Research Institute
Curated by ChEMBL
Assay Description
Inhibition of recombinant human 5-alpha reductase-2 at a concentration of 5 microL after preincubation for 10 minutes
J Med Chem 36: 4313-5 (1994)
BindingDB Entry DOI: 10.7270/Q2PK0F76