BDBM50043619 CHEMBL1711204
SMILES: CN(Cc1ccccc1)C(=O)c1ccc(cc1)S(=O)(=O)N(C)c1ccccc1
InChI Key: InChIKey=IMBPDUMBJKDSPJ-UHFFFAOYSA-N
Data: 1 IC50
Activity Spreadsheet -- Enzyme Inhibition Constant Data from BindingDB
Found 1 hit for monomerid = 50043619
Trg + Lig
Ki
nM
ΔG°
kcal/mole
IC50
nM
Kd
nM
EC50/IC50
nM
koff
s-1
kon
M-1s-1
pHTemp
°C
LIM domain kinase 2
(Homo sapiens (Human))
BDBM50043619
(CHEMBL1711204)
Show SMILES CN(Cc1ccccc1)C(=O)c1ccc(cc1)S(=O)(=O)N(C)c1ccccc1
Show InChI InChI=1S/C22H22N2O3S/c1-23(17-18-9-5-3-6-10-18)22(25)19-13-15-21(16-14-19)28(26,27)24(2)20-11-7-4-8-12-20/h3-16H,17H2,1-2H3
NCI pathway
Reactome pathway
n/an/a 95n/an/an/an/an/an/a
Lexicon Pharmaceuticals
Curated by ChEMBL
Assay Description
Inhibition of human full-length LIMK2 expressed in Sf9 cells assessed as incorporation of [33P] from ATP into biotinylated-cofilin substrate in prese...
ACS Med Chem Lett 6: 53-7 (2015)
Article DOI: 10.1021/ml500242y
BindingDB Entry DOI: 10.7270/Q2SQ9207