BDBM50043625 CHEMBL3355489
SMILES: CN(Cc1ccccc1)C(=O)c1ccc(cc1)S(=O)(=O)Nc1cccc(F)c1
InChI Key: InChIKey=GSKLEHKWVKSVHN-UHFFFAOYSA-N
Data: 1 IC50
Activity Spreadsheet -- Enzyme Inhibition Constant Data from BindingDB
Found 1 hit for monomerid = 50043625
Trg + Lig
Ki
nM
ΔG°
kcal/mole
IC50
nM
Kd
nM
EC50/IC50
nM
koff
s-1
kon
M-1s-1
pHTemp
°C
LIM domain kinase 2
(Homo sapiens (Human))
BDBM50043625
(CHEMBL3355489)
Show SMILES CN(Cc1ccccc1)C(=O)c1ccc(cc1)S(=O)(=O)Nc1cccc(F)c1
Show InChI InChI=1S/C21H19FN2O3S/c1-24(15-16-6-3-2-4-7-16)21(25)17-10-12-20(13-11-17)28(26,27)23-19-9-5-8-18(22)14-19/h2-14,23H,15H2,1H3
NCI pathway
Reactome pathway
n/an/a 22n/an/an/an/an/an/a
Lexicon Pharmaceuticals
Curated by ChEMBL
Assay Description
Inhibition of human full-length LIMK2 expressed in Sf9 cells assessed as incorporation of [33P] from ATP into biotinylated-cofilin substrate in prese...
ACS Med Chem Lett 6: 53-7 (2015)
Article DOI: 10.1021/ml500242y
BindingDB Entry DOI: 10.7270/Q2SQ9207