BDBM50043875 CHEMBL3356061
SMILES: Cc1n[nH]c2nc(cnc12)-c1ccc(NS(=O)(=O)c2cc(F)ccc2F)cc1
InChI Key: InChIKey=SLFPVIVLDVLCRB-UHFFFAOYSA-N
Data: 2 IC50
Activity Spreadsheet -- Enzyme Inhibition Constant Data from BindingDB
Found 2 hits for monomerid = 50043875
Trg + Lig
Ki
nM
ΔG°
kcal/mole
IC50
nM
Kd
nM
EC50/IC50
nM
koff
s-1
kon
M-1s-1
pHTemp
°C
Serine/threonine-protein kinase Sgk1
(Homo sapiens (Human))
BDBM50043875
(CHEMBL3356061)
Show SMILES Cc1n[nH]c2nc(cnc12)-c1ccc(NS(=O)(=O)c2cc(F)ccc2F)cc1
Show InChI InChI=1S/C18H13F2N5O2S/c1-10-17-18(24-23-10)22-15(9-21-17)11-2-5-13(6-3-11)25-28(26,27)16-8-12(19)4-7-14(16)20/h2-9,25H,1H3,(H,22,23,24)
Reactome pathway
n/an/a 29n/an/an/an/an/an/a
Sanofi R&D
Curated by ChEMBL
Assay Description
Inhibition of human SGK1 using fluo-5(6)-carboxyfluorescein)-RPRAATF-NH2 fluorescently labeled peptide by substrate phosphorylation assay in presence...
ACS Med Chem Lett 6: 73-8 (2015)
Article DOI: 10.1021/ml5003376
BindingDB Entry DOI: 10.7270/Q28S4RJT
Serine/threonine-protein kinase Sgk1
(Homo sapiens (Human))
BDBM50043875
(CHEMBL3356061)
Show SMILES Cc1n[nH]c2nc(cnc12)-c1ccc(NS(=O)(=O)c2cc(F)ccc2F)cc1
Show InChI InChI=1S/C18H13F2N5O2S/c1-10-17-18(24-23-10)22-15(9-21-17)11-2-5-13(6-3-11)25-28(26,27)16-8-12(19)4-7-14(16)20/h2-9,25H,1H3,(H,22,23,24)
Reactome pathway
n/an/a 1.34E+3n/an/an/an/an/an/a
Sanofi R&D
Curated by ChEMBL
Assay Description
Inhibition of human SGK1 using fluo-5(6)-carboxyfluorescein)-RPRAATF-NH2 fluorescently labeled peptide by substrate phosphorylation assay in presence...
ACS Med Chem Lett 6: 73-8 (2015)
Article DOI: 10.1021/ml5003376
BindingDB Entry DOI: 10.7270/Q28S4RJT