BDBM50043880 CHEMBL3356036
SMILES: Nc1n[nH]c2cc(ccc12)-c1ccc(NS(=O)(=O)c2cccc(Cl)c2F)cc1
InChI Key: InChIKey=PTVOZHCTMAQRJE-UHFFFAOYSA-N
Data: 2 IC50
Activity Spreadsheet -- Enzyme Inhibition Constant Data from BindingDB
Found 2 hits for monomerid = 50043880
Trg + Lig
Ki
nM
ΔG°
kcal/mole
IC50
nM
Kd
nM
EC50/IC50
nM
koff
s-1
kon
M-1s-1
pHTemp
°C
Serine/threonine-protein kinase Sgk1
(Homo sapiens (Human))
BDBM50043880
(CHEMBL3356036)
Show SMILES Nc1n[nH]c2cc(ccc12)-c1ccc(NS(=O)(=O)c2cccc(Cl)c2F)cc1
Show InChI InChI=1S/C19H14ClFN4O2S/c20-15-2-1-3-17(18(15)21)28(26,27)25-13-7-4-11(5-8-13)12-6-9-14-16(10-12)23-24-19(14)22/h1-10,25H,(H3,22,23,24)
Reactome pathway
n/an/a 169n/an/an/an/an/an/a
Sanofi R&D
Curated by ChEMBL
Assay Description
Inhibition of human SGK1 using fluo-5(6)-carboxyfluorescein)-RPRAATF-NH2 fluorescently labeled peptide by substrate phosphorylation assay in presence...
ACS Med Chem Lett 6: 73-8 (2015)
Article DOI: 10.1021/ml5003376
BindingDB Entry DOI: 10.7270/Q28S4RJT
Serine/threonine-protein kinase Sgk1
(Homo sapiens (Human))
BDBM50043880
(CHEMBL3356036)
Show SMILES Nc1n[nH]c2cc(ccc12)-c1ccc(NS(=O)(=O)c2cccc(Cl)c2F)cc1
Show InChI InChI=1S/C19H14ClFN4O2S/c20-15-2-1-3-17(18(15)21)28(26,27)25-13-7-4-11(5-8-13)12-6-9-14-16(10-12)23-24-19(14)22/h1-10,25H,(H3,22,23,24)
Reactome pathway
n/an/a<5n/an/an/an/an/an/a
Sanofi R&D
Curated by ChEMBL
Assay Description
Inhibition of human SGK1 using fluo-5(6)-carboxyfluorescein)-RPRAATF-NH2 fluorescently labeled peptide by substrate phosphorylation assay in presence...
ACS Med Chem Lett 6: 73-8 (2015)
Article DOI: 10.1021/ml5003376
BindingDB Entry DOI: 10.7270/Q28S4RJT