BDBM50043922 CHEMBL3356016
SMILES: Nc1n[nH]c2cc(ccc12)-c1ccc(NS(=O)(=O)Cc2cc(F)ccc2F)cc1
InChI Key: InChIKey=QNUFYOXCESWZGT-UHFFFAOYSA-N
Data: 2 IC50
Activity Spreadsheet -- Enzyme Inhibition Constant Data from BindingDB
Found 2 hits for monomerid = 50043922
Trg + Lig
Ki
nM
ΔG°
kcal/mole
IC50
nM
Kd
nM
EC50/IC50
nM
koff
s-1
kon
M-1s-1
pHTemp
°C
Serine/threonine-protein kinase Sgk1
(Homo sapiens (Human))
BDBM50043922
(CHEMBL3356016)
Show SMILES Nc1n[nH]c2cc(ccc12)-c1ccc(NS(=O)(=O)Cc2cc(F)ccc2F)cc1
Show InChI InChI=1S/C20H16F2N4O2S/c21-15-4-8-18(22)14(9-15)11-29(27,28)26-16-5-1-12(2-6-16)13-3-7-17-19(10-13)24-25-20(17)23/h1-10,26H,11H2,(H3,23,24,25)
Reactome pathway
n/an/a 28n/an/an/an/an/an/a
Sanofi R&D
Curated by ChEMBL
Assay Description
Inhibition of human SGK1 using fluo-5(6)-carboxyfluorescein)-RPRAATF-NH2 fluorescently labeled peptide by substrate phosphorylation assay in presence...
ACS Med Chem Lett 6: 73-8 (2015)
Article DOI: 10.1021/ml5003376
BindingDB Entry DOI: 10.7270/Q28S4RJT
Serine/threonine-protein kinase Sgk1
(Homo sapiens (Human))
BDBM50043922
(CHEMBL3356016)
Show SMILES Nc1n[nH]c2cc(ccc12)-c1ccc(NS(=O)(=O)Cc2cc(F)ccc2F)cc1
Show InChI InChI=1S/C20H16F2N4O2S/c21-15-4-8-18(22)14(9-15)11-29(27,28)26-16-5-1-12(2-6-16)13-3-7-17-19(10-13)24-25-20(17)23/h1-10,26H,11H2,(H3,23,24,25)
Reactome pathway
n/an/a 9.83E+3n/an/an/an/an/an/a
Sanofi R&D
Curated by ChEMBL
Assay Description
Inhibition of human SGK1 using fluo-5(6)-carboxyfluorescein)-RPRAATF-NH2 fluorescently labeled peptide by substrate phosphorylation assay in presence...
ACS Med Chem Lett 6: 73-8 (2015)
Article DOI: 10.1021/ml5003376
BindingDB Entry DOI: 10.7270/Q28S4RJT