BDBM50044625 CHEMBL3360190
SMILES: [H][C@]12CC(C)(C)[C@]1([H])CC\C=C\CCC2=C
InChI Key: InChIKey=NSBBNKZXPXCEKG-SCDDQDLZSA-N
Data: 1 KI  1 Kd  2 EC50
Activity Spreadsheet -- Enzyme Inhibition Constant Data from BindingDB
Found 4 hits for monomerid = 50044625
Trg + Lig
Ki
nM
ΔG°
kcal/mole
IC50
nM
Kd
nM
EC50/IC50
nM
koff
s-1
kon
M-1s-1
pHTemp
°C
Cannabinoid receptor 2
(Homo sapiens (Human))
BDBM50044625
(CHEMBL3360190)
Show SMILES [H][C@]12CC(C)(C)[C@]1([H])CC\C=C\CCC2=C |r,t:11|
Show InChI InChI=1S/C14H22/c1-11-8-6-4-5-7-9-13-12(11)10-14(13,2)3/h4-5,12-13H,1,6-10H2,2-3H3/b5-4+/t12?,13-/m1/s1
Reactome pathway
780n/an/an/an/an/an/an/an/a
Korea University
Curated by ChEMBL
Assay Description
Inhibition of CB2 receptor (unknown origin)
Bioorg Med Chem Lett 24: 3168-74 (2014)
Article DOI: 10.1016/j.bmcl.2014.04.112
BindingDB Entry DOI: 10.7270/Q2SN0BK2
Peroxisome proliferator-activated receptor alpha (PPAR alpha)
(Homo sapiens (Human))
BDBM50044625
(CHEMBL3360190)
Show SMILES [H][C@]12CC(C)(C)[C@]1([H])CC\C=C\CCC2=C |r,t:11|
Show InChI InChI=1S/C14H22/c1-11-8-6-4-5-7-9-13-12(11)10-14(13,2)3/h4-5,12-13H,1,6-10H2,2-3H3/b5-4+/t12?,13-/m1/s1
n/an/an/a 1.93E+3n/an/an/an/an/a
Korea University
Curated by ChEMBL
Assay Description
Binding affinity to human PPAR-alpha LBD assessed as recruitment of fluorescein-labeled coactivator peptide by surface plasmon resonance method
Bioorg Med Chem Lett 24: 3168-74 (2014)
Article DOI: 10.1016/j.bmcl.2014.04.112
BindingDB Entry DOI: 10.7270/Q2SN0BK2
Peroxisome proliferator-activated receptor alpha (PPAR alpha)
(Homo sapiens (Human))
BDBM50044625
(CHEMBL3360190)
Show SMILES [H][C@]12CC(C)(C)[C@]1([H])CC\C=C\CCC2=C |r,t:11|
Show InChI InChI=1S/C14H22/c1-11-8-6-4-5-7-9-13-12(11)10-14(13,2)3/h4-5,12-13H,1,6-10H2,2-3H3/b5-4+/t12?,13-/m1/s1
n/an/an/an/a 9.58E+3n/an/an/an/a
Korea University
Curated by ChEMBL
Assay Description
Agonist activity at PPAR-alpha (unknown origin) expressed in HEK293 cells by luciferase reporter gene assay
Bioorg Med Chem Lett 24: 3168-74 (2014)
Article DOI: 10.1016/j.bmcl.2014.04.112
BindingDB Entry DOI: 10.7270/Q2SN0BK2
Peroxisome proliferator-activated receptor alpha (PPAR alpha)
(Homo sapiens (Human))
BDBM50044625
(CHEMBL3360190)
Show SMILES [H][C@]12CC(C)(C)[C@]1([H])CC\C=C\CCC2=C |r,t:11|
Show InChI InChI=1S/C14H22/c1-11-8-6-4-5-7-9-13-12(11)10-14(13,2)3/h4-5,12-13H,1,6-10H2,2-3H3/b5-4+/t12?,13-/m1/s1
n/an/an/an/a 3.20E+3n/an/an/an/a
Korea University
Curated by ChEMBL
Assay Description
Agonist activity at PPAR-alpha (unknown origin) expressed in HEK293 cells by TR-FRET assay
Bioorg Med Chem Lett 24: 3168-74 (2014)
Article DOI: 10.1016/j.bmcl.2014.04.112
BindingDB Entry DOI: 10.7270/Q2SN0BK2