BDBM50044833 CHEMBL3311184
SMILES: CCCNc1cc(NC(=O)c2ccccc2)cc(c1)C(F)(F)F
InChI Key: InChIKey=CSKJIIXTWHNKSV-UHFFFAOYSA-N
Data: 2 IC50
Activity Spreadsheet -- Enzyme Inhibition Constant Data from BindingDB
Found 2 hits for monomerid = 50044833
Trg + Lig
Ki
nM
ΔG°
kcal/mole
IC50
nM
Kd
nM
EC50/IC50
nM
koff
s-1
kon
M-1s-1
pHTemp
°C
Cytochrome P450 1A2
(Homo sapiens (Human))
BDBM50044833
(CHEMBL3311184)
Show SMILES CCCNc1cc(NC(=O)c2ccccc2)cc(c1)C(F)(F)F
Show InChI InChI=1S/C17H17F3N2O/c1-2-8-21-14-9-13(17(18,19)20)10-15(11-14)22-16(23)12-6-4-3-5-7-12/h3-7,9-11,21H,2,8H2,1H3,(H,22,23)
Reactome pathway
n/an/a 140n/an/an/an/an/an/a
AstraZeneca
Curated by ChEMBL
Assay Description
Competitive inhibition of CYP1A2 in human liver microsomes by LC-MS/MS analysis
Bioorg Med Chem Lett 24: 3204-6 (2014)
Article DOI: 10.1016/j.bmcl.2014.05.013
BindingDB Entry DOI: 10.7270/Q2H41T2V
Transient receptor potential cation channel subfamily A member 1
(Homo sapiens (Human))
BDBM50044833
(CHEMBL3311184)
Show SMILES CCCNc1cc(NC(=O)c2ccccc2)cc(c1)C(F)(F)F
Show InChI InChI=1S/C17H17F3N2O/c1-2-8-21-14-9-13(17(18,19)20)10-15(11-14)22-16(23)12-6-4-3-5-7-12/h3-7,9-11,21H,2,8H2,1H3,(H,22,23)
n/an/a 200n/an/an/an/an/an/a
AstraZeneca
Curated by ChEMBL
Assay Description
Antagonist activity at human TRPA1 expressed in HEK293-TREx cells assessed as change in calcium level by Fluo-4NW assay
Bioorg Med Chem Lett 24: 3204-6 (2014)
Article DOI: 10.1016/j.bmcl.2014.05.013
BindingDB Entry DOI: 10.7270/Q2H41T2V