null
SMILES: COC(=O)c1cc(C)c(NS(=O)(=O)c2ccc(OC)cc2)c(C)c1
InChI Key: InChIKey=CFXOOELIVVWHJG-UHFFFAOYSA-N
Activity Spreadsheet -- Enzyme Inhibition Constant Data from BindingDB
Found 1 hit for monomerid = 50044882
Trg + Lig
Ki
nM
ΔG°
kcal/mole
IC50
nM
Kd
nM
EC50/IC50
nM
koff
s-1
kon
M-1s-1
pHTemp
°C
Free fatty acid receptor 4
(Homo sapiens (Human))
BDBM50044882
(CHEMBL3311201)
Show SMILES COC(=O)c1cc(C)c(NS(=O)(=O)c2ccc(OC)cc2)c(C)c1
Show InChI InChI=1S/C17H19NO5S/c1-11-9-13(17(19)23-4)10-12(2)16(11)18-24(20,21)15-7-5-14(22-3)6-8-15/h5-10,18H,1-4H3
Reactome pathway
n/an/an/an/a<3.16E+4n/an/an/an/a
GlaxoSmithKline
Curated by ChEMBL
Assay Description
Agonist activity at human FFA4 receptor expressed in U2OS cells assessed as calcium mobilization after 24 hrs by FLIPR
Bioorg Med Chem Lett 24: 3100-3 (2014)
Article DOI: 10.1016/j.bmcl.2014.05.012
BindingDB Entry DOI: 10.7270/Q2CC1292