BDBM50045007 2-(3H-Imidazo[4,5-b]pyridin-2-yl)-phenol::CHEMBL28597
SMILES: Oc1ccccc1-c1nc2ncccc2[nH]1
InChI Key: InChIKey=TXIZWDGGKIUXDT-UHFFFAOYSA-N
Data: 1 IC50
Activity Spreadsheet -- Enzyme Inhibition Constant Data from BindingDB
Found 1 hit for monomerid = 50045007
Trg + Lig
Ki
nM
ΔG°
kcal/mole
IC50
nM
Kd
nM
EC50/IC50
nM
koff
s-1
kon
M-1s-1
pHTemp
°C
cGMP-specific 3',5'-cyclic phosphodiesterase
(Homo sapiens (Human))
BDBM50045007
(2-(3H-Imidazo[4,5-b]pyridin-2-yl)-phenol | CHEMBL2...)
Show SMILES Oc1ccccc1-c1nc2ncccc2[nH]1
Show InChI InChI=1S/C12H9N3O/c16-10-6-2-1-4-8(10)11-14-9-5-3-7-13-12(9)15-11/h1-7,16H,(H,13,14,15)
Reactome pathway
n/an/a 3.70E+4n/an/an/an/an/an/a
SmithKline Beecham Pharmaceuticals
Curated by ChEMBL
Assay Description
In vitro inhibition of PDE-V isolated from porcine pulmonary artery.
J Med Chem 36: 1387-92 (1993)
BindingDB Entry DOI: 10.7270/Q2JW8FHP