BDBM50045013 2-(2-Butoxy-phenyl)-3H-imidazo[4,5-b]pyridine::CHEMBL32183
SMILES: CCCCOc1ccccc1-c1nc2ncccc2[nH]1
InChI Key: InChIKey=KRERIEJRCQLQLV-UHFFFAOYSA-N
Data: 2 IC50
Activity Spreadsheet -- Enzyme Inhibition Constant Data from BindingDB
Found 2 hits for monomerid = 50045013
Trg + Lig
Ki
nM
ΔG°
kcal/mole
IC50
nM
Kd
nM
EC50/IC50
nM
koff
s-1
kon
M-1s-1
pHTemp
°C
Phosphodiesterase 4
(Homo sapiens (Human))
BDBM50045013
(2-(2-Butoxy-phenyl)-3H-imidazo[4,5-b]pyridine | CH...)
Show SMILES CCCCOc1ccccc1-c1nc2ncccc2[nH]1
Show InChI InChI=1S/C16H17N3O/c1-2-3-11-20-14-9-5-4-7-12(14)15-18-13-8-6-10-17-16(13)19-15/h4-10H,2-3,11H2,1H3,(H,17,18,19)
n/an/a 6.00E+3n/an/an/an/an/an/a
SmithKline Beecham Pharmaceuticals
Curated by ChEMBL
Assay Description
In vitro inhibition of PDE-IV isolated from guinea pig ventricle.
J Med Chem 36: 1387-92 (1993)
BindingDB Entry DOI: 10.7270/Q2JW8FHP
cGMP-specific 3',5'-cyclic phosphodiesterase
(Homo sapiens (Human))
BDBM50045013
(2-(2-Butoxy-phenyl)-3H-imidazo[4,5-b]pyridine | CH...)
Show SMILES CCCCOc1ccccc1-c1nc2ncccc2[nH]1
Show InChI InChI=1S/C16H17N3O/c1-2-3-11-20-14-9-5-4-7-12(14)15-18-13-8-6-10-17-16(13)19-15/h4-10H,2-3,11H2,1H3,(H,17,18,19)
Reactome pathway
n/an/a 1.00E+3n/an/an/an/an/an/a
SmithKline Beecham Pharmaceuticals
Curated by ChEMBL
Assay Description
In vitro inhibition of PDE-V isolated from porcine pulmonary artery.
J Med Chem 36: 1387-92 (1993)
BindingDB Entry DOI: 10.7270/Q2JW8FHP