BDBM50045184 4-[2-(3,4-Dichloro-phenyl)-acetyl]-3-pyrrolidin-1-ylmethyl-piperazine-1-carboxylic acid ethyl ester::CHEMBL408054
SMILES: CCOC(=O)N1CCN(C(CN2CCCC2)C1)C(=O)Cc1ccc(Cl)c(Cl)c1
InChI Key: InChIKey=NAILEPLTGOUWNK-UHFFFAOYSA-N
Data: 1 IC50
Activity Spreadsheet -- Enzyme Inhibition Constant Data from BindingDB
Found 1 hit for monomerid = 50045184
Trg + Lig
Ki
nM
ΔG°
kcal/mole
IC50
nM
Kd
nM
EC50/IC50
nM
koff
s-1
kon
M-1s-1
pHTemp
°C
Kappa-type opioid receptor
(Homo sapiens (Human))
BDBM50045184
(4-[2-(3,4-Dichloro-phenyl)-acetyl]-3-pyrrolidin-1-...)
Show SMILES CCOC(=O)N1CCN(C(CN2CCCC2)C1)C(=O)Cc1ccc(Cl)c(Cl)c1
Show InChI InChI=1S/C20H27Cl2N3O3/c1-2-28-20(27)24-9-10-25(16(14-24)13-23-7-3-4-8-23)19(26)12-15-5-6-17(21)18(22)11-15/h5-6,11,16H,2-4,7-10,12-14H2,1H3
Reactome pathway
n/an/a 3.5n/an/an/an/an/an/a
Glaxo Group Research Ltd.
Curated by ChEMBL
Assay Description
In vitro agonist activity at kappa opioid receptor in rabbit vas deferens.
J Med Chem 36: 2075-83 (1993)
BindingDB Entry DOI: 10.7270/Q2D50NKJ