BDBM50045327 CHEMBL3311349
SMILES: Cc1ccc(CCCC(=O)c2ccc(COC[C@@](C)(N)COP(O)(O)=O)cc2C)cc1
InChI Key: InChIKey=QCHBYMVLJFALLE-HSZRJFAPSA-N
Data: 2 EC50
Activity Spreadsheet -- Enzyme Inhibition Constant Data from BindingDB
Found 2 hits for monomerid = 50045327
Trg + Lig
Ki
nM
ΔG°
kcal/mole
IC50
nM
Kd
nM
EC50/IC50
nM
koff
s-1
kon
M-1s-1
pHTemp
°C
Sphingosine 1-phosphate receptor 3
(Homo sapiens (Human))
BDBM50045327
(CHEMBL3311349)
Show SMILES Cc1ccc(CCCC(=O)c2ccc(COC[C@@](C)(N)COP(O)(O)=O)cc2C)cc1 |r|
Show InChI InChI=1S/C23H32NO6P/c1-17-7-9-19(10-8-17)5-4-6-22(25)21-12-11-20(13-18(21)2)14-29-15-23(3,24)16-30-31(26,27)28/h7-13H,4-6,14-16,24H2,1-3H3,(H2,26,27,28)/t23-/m1/s1
NCI pathway
Reactome pathway
n/an/an/an/a>2.00E+4n/an/an/an/a
Daiichi Sankyo Co, Ltd
Curated by ChEMBL
Assay Description
Agonist activity at human S1P3 receptor expressed in CHOK1 cell membranes by [35S]GTPgammaS binding assay
Bioorg Med Chem 22: 4246-56 (2014)
Article DOI: 10.1016/j.bmc.2014.05.035
BindingDB Entry DOI: 10.7270/Q2PN9788
Sphingosine 1-phosphate receptor 1
(Homo sapiens (Human))
BDBM50045327
(CHEMBL3311349)
Show SMILES Cc1ccc(CCCC(=O)c2ccc(COC[C@@](C)(N)COP(O)(O)=O)cc2C)cc1 |r|
Show InChI InChI=1S/C23H32NO6P/c1-17-7-9-19(10-8-17)5-4-6-22(25)21-12-11-20(13-18(21)2)14-29-15-23(3,24)16-30-31(26,27)28/h7-13H,4-6,14-16,24H2,1-3H3,(H2,26,27,28)/t23-/m1/s1
Reactome pathway
n/an/an/an/a 19n/an/an/an/a
Daiichi Sankyo Co, Ltd
Curated by ChEMBL
Assay Description
Agonist activity at human S1P1 receptor expressed in CHOK1 cell membranes by [35S]GTPgammaS binding assay
Bioorg Med Chem 22: 4246-56 (2014)
Article DOI: 10.1016/j.bmc.2014.05.035
BindingDB Entry DOI: 10.7270/Q2PN9788