BDBM50045611 CHEMBL3314291::US9540323, 77::US9540323, example 77
SMILES: CCOC(=O)C1(C)CN(c2c1c(Cl)ccc2O)c1ccccc1NC(=O)Nc1nc2ccc(Cl)nc2s1
InChI Key: InChIKey=QBYHAJNALVUHHL-UHFFFAOYSA-N
Data: 1 KI  2 IC50
Activity Spreadsheet -- Enzyme Inhibition Constant Data from BindingDB
Found 3 hits for monomerid = 50045611
Trg + Lig
Ki
nM
ΔG°
kcal/mole
IC50
nM
Kd
nM
EC50/IC50
nM
koff
s-1
kon
M-1s-1
pHTemp
°C
Purinergic receptor P2Y1
(Homo sapiens (Human))
BDBM50045611
(CHEMBL3314291 | US9540323, 77 | US9540323, example...)
Show SMILES CCOC(=O)C1(C)CN(c2c1c(Cl)ccc2O)c1ccccc1NC(=O)Nc1nc2ccc(Cl)nc2s1
Show InChI InChI=1S/C25H21Cl2N5O4S/c1-3-36-22(34)25(2)12-32(20-17(33)10-8-13(26)19(20)25)16-7-5-4-6-14(16)28-23(35)31-24-29-15-9-11-18(27)30-21(15)37-24/h4-11,33H,3,12H2,1-2H3,(H2,28,29,31,35)
US Patent
13 -10.8n/an/an/an/an/a7.425
Bristol-Myers Squibb Company
US Patent
Assay Description
A SPA membrane binding assay was used to identify inhibitors of [33P] 2MeS-ADP binding to cloned human P2Y1 receptors (The P2Y1 receptor membranes we...
US Patent US9540323 (2017)
BindingDB Entry DOI: 10.7270/Q289141P
Purinergic receptor P2Y1
(Homo sapiens (Human))
BDBM50045611
(CHEMBL3314291 | US9540323, 77 | US9540323, example...)
Show SMILES CCOC(=O)C1(C)CN(c2c1c(Cl)ccc2O)c1ccccc1NC(=O)Nc1nc2ccc(Cl)nc2s1
Show InChI InChI=1S/C25H21Cl2N5O4S/c1-3-36-22(34)25(2)12-32(20-17(33)10-8-13(26)19(20)25)16-7-5-4-6-14(16)28-23(35)31-24-29-15-9-11-18(27)30-21(15)37-24/h4-11,33H,3,12H2,1-2H3,(H2,28,29,31,35)
n/an/a 610n/an/an/an/an/an/a
Bristol-Myers Squibb Research
Curated by ChEMBL
Assay Description
Antagonist activity at P2Y1 receptor in platelet-enriched human plasma assessed as 10 uM ADP-induced platelet aggregation preincubated for 1 min foll...
J Med Chem 57: 6150-64 (2014)
Article DOI: 10.1021/jm5006226
BindingDB Entry DOI: 10.7270/Q20Z74XP
Purinergic receptor P2Y1
(Homo sapiens (Human))
BDBM50045611
(CHEMBL3314291 | US9540323, 77 | US9540323, example...)
Show SMILES CCOC(=O)C1(C)CN(c2c1c(Cl)ccc2O)c1ccccc1NC(=O)Nc1nc2ccc(Cl)nc2s1
Show InChI InChI=1S/C25H21Cl2N5O4S/c1-3-36-22(34)25(2)12-32(20-17(33)10-8-13(26)19(20)25)16-7-5-4-6-14(16)28-23(35)31-24-29-15-9-11-18(27)30-21(15)37-24/h4-11,33H,3,12H2,1-2H3,(H2,28,29,31,35)
n/an/a 0.0500n/an/an/an/an/an/a
Bristol-Myers Squibb Research
Curated by ChEMBL
Assay Description
Antagonist activity at P2Y1 receptor in washed human platelets assessed as 1 uM 2-methylthio-ADP-induced calcium flux by FLIPR assay
J Med Chem 57: 6150-64 (2014)
Article DOI: 10.1021/jm5006226
BindingDB Entry DOI: 10.7270/Q20Z74XP