BDBM50045624 CHEMBL3314304::US9540323, 209::US9540323, example 209
SMILES: CC1(C)CN(c2c1c(ccc2O)-c1ccc(F)cc1)c1ccccc1NC(=O)Nc1nc2ccc(Cl)nc2s1
InChI Key: InChIKey=OGCXTBNXXPGJEE-UHFFFAOYSA-N
Data: 1 KI  2 IC50
Activity Spreadsheet -- Enzyme Inhibition Constant Data from BindingDB
Found 3 hits for monomerid = 50045624
Trg + Lig
Ki
nM
ΔG°
kcal/mole
IC50
nM
Kd
nM
EC50/IC50
nM
koff
s-1
kon
M-1s-1
pHTemp
°C
Purinergic receptor P2Y1
(Homo sapiens (Human))
BDBM50045624
(CHEMBL3314304 | US9540323, 209 | US9540323, exampl...)
Show SMILES CC1(C)CN(c2c1c(ccc2O)-c1ccc(F)cc1)c1ccccc1NC(=O)Nc1nc2ccc(Cl)nc2s1
Show InChI InChI=1S/C29H23ClFN5O2S/c1-29(2)15-36(25-22(37)13-11-18(24(25)29)16-7-9-17(31)10-8-16)21-6-4-3-5-19(21)32-27(38)35-28-33-20-12-14-23(30)34-26(20)39-28/h3-14,37H,15H2,1-2H3,(H2,32,33,35,38)
US Patent
13 -10.8n/an/an/an/an/a7.425
Bristol-Myers Squibb Company
US Patent
Assay Description
A SPA membrane binding assay was used to identify inhibitors of [33P] 2MeS-ADP binding to cloned human P2Y1 receptors (The P2Y1 receptor membranes we...
US Patent US9540323 (2017)
BindingDB Entry DOI: 10.7270/Q289141P
Purinergic receptor P2Y1
(Homo sapiens (Human))
BDBM50045624
(CHEMBL3314304 | US9540323, 209 | US9540323, exampl...)
Show SMILES CC1(C)CN(c2c1c(ccc2O)-c1ccc(F)cc1)c1ccccc1NC(=O)Nc1nc2ccc(Cl)nc2s1
Show InChI InChI=1S/C29H23ClFN5O2S/c1-29(2)15-36(25-22(37)13-11-18(24(25)29)16-7-9-17(31)10-8-16)21-6-4-3-5-19(21)32-27(38)35-28-33-20-12-14-23(30)34-26(20)39-28/h3-14,37H,15H2,1-2H3,(H2,32,33,35,38)
n/an/a 230n/an/an/an/an/an/a
Bristol-Myers Squibb Research
Curated by ChEMBL
Assay Description
Antagonist activity at P2Y1 receptor in platelet-enriched human plasma assessed as 10 uM ADP-induced platelet aggregation preincubated for 1 min foll...
J Med Chem 57: 6150-64 (2014)
Article DOI: 10.1021/jm5006226
BindingDB Entry DOI: 10.7270/Q20Z74XP
Purinergic receptor P2Y1
(Homo sapiens (Human))
BDBM50045624
(CHEMBL3314304 | US9540323, 209 | US9540323, exampl...)
Show SMILES CC1(C)CN(c2c1c(ccc2O)-c1ccc(F)cc1)c1ccccc1NC(=O)Nc1nc2ccc(Cl)nc2s1
Show InChI InChI=1S/C29H23ClFN5O2S/c1-29(2)15-36(25-22(37)13-11-18(24(25)29)16-7-9-17(31)10-8-16)21-6-4-3-5-19(21)32-27(38)35-28-33-20-12-14-23(30)34-26(20)39-28/h3-14,37H,15H2,1-2H3,(H2,32,33,35,38)
n/an/a 0.130n/an/an/an/an/an/a
Bristol-Myers Squibb Research
Curated by ChEMBL
Assay Description
Antagonist activity at P2Y1 receptor in washed human platelets assessed as 1 uM 2-methylthio-ADP-induced calcium flux by FLIPR assay
J Med Chem 57: 6150-64 (2014)
Article DOI: 10.1021/jm5006226
BindingDB Entry DOI: 10.7270/Q20Z74XP