BDBM50045890 CHEMBL99069::{2-[2-(4-Fluoro-phenyl)-1H-indol-3-yl]-ethyl}-dihexyl-amine
SMILES: CCCCCCN(CCCCCC)CCc1c([nH]c2ccccc12)-c1ccc(F)cc1
InChI Key: InChIKey=XCQPSLZWMGPTBR-UHFFFAOYSA-N
Data: 1 KI  8 IC50
Activity Spreadsheet -- Enzyme Inhibition Constant Data from BindingDB
Found 9 hits for monomerid = 50045890
Trg + Lig
Ki
nM
ΔG°
kcal/mole
IC50
nM
Kd
nM
EC50/IC50
nM
koff
s-1
kon
M-1s-1
pHTemp
°C
Peripheral-Type Benzodiazepine Receptor
(Rattus norvegicus (rat))
BDBM50045890
(CHEMBL99069 | {2-[2-(4-Fluoro-phenyl)-1H-indol-3-y...)
Show SMILES CCCCCCN(CCCCCC)CCc1c([nH]c2ccccc12)-c1ccc(F)cc1
Show InChI InChI=1S/C28H39FN2/c1-3-5-7-11-20-31(21-12-8-6-4-2)22-19-26-25-13-9-10-14-27(25)30-28(26)23-15-17-24(29)18-16-23/h9-10,13-18,30H,3-8,11-12,19-22H2,1-2H3
200n/an/an/an/an/an/an/an/a
Mayo Foundation for Medical Education and Research
Curated by ChEMBL
Assay Description
Binding affinity against mitochondrial DBI complex (peripheral benzodiazepine receptor) using primary cultures of glial cells
J Med Chem 36: 2908-20 (1993)
BindingDB Entry DOI: 10.7270/Q2C24VGV
Cannabinoid receptor 1
(Rattus norvegicus (rat))
BDBM50045890
(CHEMBL99069 | {2-[2-(4-Fluoro-phenyl)-1H-indol-3-y...)
Show SMILES CCCCCCN(CCCCCC)CCc1c([nH]c2ccccc12)-c1ccc(F)cc1
Show InChI InChI=1S/C28H39FN2/c1-3-5-7-11-20-31(21-12-8-6-4-2)22-19-26-25-13-9-10-14-27(25)30-28(26)23-15-17-24(29)18-16-23/h9-10,13-18,30H,3-8,11-12,19-22H2,1-2H3
Reactome pathway
n/an/a>1.00E+3n/an/an/an/an/an/a
Mayo Foundation for Medical Education and Research
Curated by ChEMBL
Assay Description
Inhibitory activity, measured by displacement [3H]-CP-55,940 from cannabinoid receptor (CB1) in rat brain
J Med Chem 36: 2908-20 (1993)
BindingDB Entry DOI: 10.7270/Q2C24VGV
Adrenergic receptor alpha
(Rattus norvegicus (rat)-Rattus norvegicus (Rat)-RA...)
BDBM50045890
(CHEMBL99069 | {2-[2-(4-Fluoro-phenyl)-1H-indol-3-y...)
Show SMILES CCCCCCN(CCCCCC)CCc1c([nH]c2ccccc12)-c1ccc(F)cc1
Show InChI InChI=1S/C28H39FN2/c1-3-5-7-11-20-31(21-12-8-6-4-2)22-19-26-25-13-9-10-14-27(25)30-28(26)23-15-17-24(29)18-16-23/h9-10,13-18,30H,3-8,11-12,19-22H2,1-2H3
n/an/a>1.00E+3n/an/an/an/an/an/a
Mayo Foundation for Medical Education and Research
Curated by ChEMBL
Assay Description
Displacement of [3H]clonidine from alpha-adrenergic receptor in rat brain
J Med Chem 36: 2908-20 (1993)
BindingDB Entry DOI: 10.7270/Q2C24VGV
Opioid receptor
(Rattus norvegicus (rat)-RAT)
BDBM50045890
(CHEMBL99069 | {2-[2-(4-Fluoro-phenyl)-1H-indol-3-y...)
Show SMILES CCCCCCN(CCCCCC)CCc1c([nH]c2ccccc12)-c1ccc(F)cc1
Show InChI InChI=1S/C28H39FN2/c1-3-5-7-11-20-31(21-12-8-6-4-2)22-19-26-25-13-9-10-14-27(25)30-28(26)23-15-17-24(29)18-16-23/h9-10,13-18,30H,3-8,11-12,19-22H2,1-2H3
Reactome pathway
n/an/a>1.00E+3n/an/an/an/an/an/a
Mayo Foundation for Medical Education and Research
Curated by ChEMBL
Assay Description
Tested for inhibitory activity by measuring its ability to displace [3H]3-PPP from opiate receptor in rat brain
J Med Chem 36: 2908-20 (1993)
BindingDB Entry DOI: 10.7270/Q2C24VGV
Serotonin 1 (5-HT1) receptor
(RAT-Rattus norvegicus (rat)-Rattus norvegicus (Rat...)
BDBM50045890
(CHEMBL99069 | {2-[2-(4-Fluoro-phenyl)-1H-indol-3-y...)
Show SMILES CCCCCCN(CCCCCC)CCc1c([nH]c2ccccc12)-c1ccc(F)cc1
Show InChI InChI=1S/C28H39FN2/c1-3-5-7-11-20-31(21-12-8-6-4-2)22-19-26-25-13-9-10-14-27(25)30-28(26)23-15-17-24(29)18-16-23/h9-10,13-18,30H,3-8,11-12,19-22H2,1-2H3
n/an/a>1.00E+3n/an/an/an/an/an/a
Mayo Foundation for Medical Education and Research
Curated by ChEMBL
Assay Description
Inhibitory activity by measuring its ability to displace [3H]ketanserin from serotonin receptor in rat brain
J Med Chem 36: 2908-20 (1993)
BindingDB Entry DOI: 10.7270/Q2C24VGV
Opioid receptor
(Rattus norvegicus (rat)-RAT)
BDBM50045890
(CHEMBL99069 | {2-[2-(4-Fluoro-phenyl)-1H-indol-3-y...)
Show SMILES CCCCCCN(CCCCCC)CCc1c([nH]c2ccccc12)-c1ccc(F)cc1
Show InChI InChI=1S/C28H39FN2/c1-3-5-7-11-20-31(21-12-8-6-4-2)22-19-26-25-13-9-10-14-27(25)30-28(26)23-15-17-24(29)18-16-23/h9-10,13-18,30H,3-8,11-12,19-22H2,1-2H3
Reactome pathway
n/an/a>1.00E+3n/an/an/an/an/an/a
Mayo Foundation for Medical Education and Research
Curated by ChEMBL
Assay Description
Inhibition of [3H]naxolone binding to opiate receptors in rat brain
J Med Chem 36: 2908-20 (1993)
BindingDB Entry DOI: 10.7270/Q2C24VGV
Adrenergic receptor beta
(Rattus norvegicus (Rat))
BDBM50045890
(CHEMBL99069 | {2-[2-(4-Fluoro-phenyl)-1H-indol-3-y...)
Show SMILES CCCCCCN(CCCCCC)CCc1c([nH]c2ccccc12)-c1ccc(F)cc1
Show InChI InChI=1S/C28H39FN2/c1-3-5-7-11-20-31(21-12-8-6-4-2)22-19-26-25-13-9-10-14-27(25)30-28(26)23-15-17-24(29)18-16-23/h9-10,13-18,30H,3-8,11-12,19-22H2,1-2H3
n/an/a>1.00E+3n/an/an/an/an/an/a
Mayo Foundation for Medical Education and Research
Curated by ChEMBL
Assay Description
Inhibitory activity by measuring its ability to displace [125I]pindolol from beta-adrenergic receptor in rat brain
J Med Chem 36: 2908-20 (1993)
BindingDB Entry DOI: 10.7270/Q2C24VGV
CCKBR
(RAT)
BDBM50045890
(CHEMBL99069 | {2-[2-(4-Fluoro-phenyl)-1H-indol-3-y...)
Show SMILES CCCCCCN(CCCCCC)CCc1c([nH]c2ccccc12)-c1ccc(F)cc1
Show InChI InChI=1S/C28H39FN2/c1-3-5-7-11-20-31(21-12-8-6-4-2)22-19-26-25-13-9-10-14-27(25)30-28(26)23-15-17-24(29)18-16-23/h9-10,13-18,30H,3-8,11-12,19-22H2,1-2H3
n/an/a>1.00E+3n/an/an/an/an/an/a
Mayo Foundation for Medical Education and Research
Curated by ChEMBL
Assay Description
Inhibitory activity by measuring its ability to displace [3H]L-365,260 from cholecystokinin receptor in rat brain
J Med Chem 36: 2908-20 (1993)
BindingDB Entry DOI: 10.7270/Q2C24VGV
Adrenergic receptor alpha
(Rattus norvegicus (rat)-Rattus norvegicus (Rat)-RA...)
BDBM50045890
(CHEMBL99069 | {2-[2-(4-Fluoro-phenyl)-1H-indol-3-y...)
Show SMILES CCCCCCN(CCCCCC)CCc1c([nH]c2ccccc12)-c1ccc(F)cc1
Show InChI InChI=1S/C28H39FN2/c1-3-5-7-11-20-31(21-12-8-6-4-2)22-19-26-25-13-9-10-14-27(25)30-28(26)23-15-17-24(29)18-16-23/h9-10,13-18,30H,3-8,11-12,19-22H2,1-2H3
n/an/a>1.00E+3n/an/an/an/an/an/a
Mayo Foundation for Medical Education and Research
Curated by ChEMBL
Assay Description
Inhibitory activity by measuring its ability to displace [3H]WB-4101 from alpha-adrenergic receptor in rat brain
J Med Chem 36: 2908-20 (1993)
BindingDB Entry DOI: 10.7270/Q2C24VGV