BDBM50045895 2-[2-(3-Chloro-phenyl)-1H-indol-3-yl]-N,N-dipropyl-acetamide::CHEMBL99726
SMILES: CCCN(CCC)C(=O)Cc1c([nH]c2ccccc12)-c1cccc(Cl)c1
InChI Key: InChIKey=IQCAEPRFTVJTSV-UHFFFAOYSA-N
Data: 1 KI  8 IC50
Activity Spreadsheet -- Enzyme Inhibition Constant Data from BindingDB
Found 9 hits for monomerid = 50045895
Trg + Lig
Ki
nM
ΔG°
kcal/mole
IC50
nM
Kd
nM
EC50/IC50
nM
koff
s-1
kon
M-1s-1
pHTemp
°C
Peripheral-Type Benzodiazepine Receptor
(Rattus norvegicus (rat))
BDBM50045895
(2-[2-(3-Chloro-phenyl)-1H-indol-3-yl]-N,N-dipropyl...)
Show SMILES CCCN(CCC)C(=O)Cc1c([nH]c2ccccc12)-c1cccc(Cl)c1
Show InChI InChI=1S/C22H25ClN2O/c1-3-12-25(13-4-2)21(26)15-19-18-10-5-6-11-20(18)24-22(19)16-8-7-9-17(23)14-16/h5-11,14,24H,3-4,12-13,15H2,1-2H3
678n/an/an/an/an/an/an/an/a
Mayo Foundation for Medical Education and Research
Curated by ChEMBL
Assay Description
Binding affinity against mitochondrial DBI complex (peripheral benzodiazepine receptor) using primary cultures of glial cells
J Med Chem 36: 2908-20 (1993)
BindingDB Entry DOI: 10.7270/Q2C24VGV
CCKBR
(RAT)
BDBM50045895
(2-[2-(3-Chloro-phenyl)-1H-indol-3-yl]-N,N-dipropyl...)
Show SMILES CCCN(CCC)C(=O)Cc1c([nH]c2ccccc12)-c1cccc(Cl)c1
Show InChI InChI=1S/C22H25ClN2O/c1-3-12-25(13-4-2)21(26)15-19-18-10-5-6-11-20(18)24-22(19)16-8-7-9-17(23)14-16/h5-11,14,24H,3-4,12-13,15H2,1-2H3
n/an/a>1.00E+3n/an/an/an/an/an/a
Mayo Foundation for Medical Education and Research
Curated by ChEMBL
Assay Description
Inhibitory activity by measuring its ability to displace [3H]L-365,260 from cholecystokinin receptor in rat brain
J Med Chem 36: 2908-20 (1993)
BindingDB Entry DOI: 10.7270/Q2C24VGV
Opioid receptor
(Rattus norvegicus (rat)-RAT)
BDBM50045895
(2-[2-(3-Chloro-phenyl)-1H-indol-3-yl]-N,N-dipropyl...)
Show SMILES CCCN(CCC)C(=O)Cc1c([nH]c2ccccc12)-c1cccc(Cl)c1
Show InChI InChI=1S/C22H25ClN2O/c1-3-12-25(13-4-2)21(26)15-19-18-10-5-6-11-20(18)24-22(19)16-8-7-9-17(23)14-16/h5-11,14,24H,3-4,12-13,15H2,1-2H3
Reactome pathway
n/an/a>1.00E+3n/an/an/an/an/an/a
Mayo Foundation for Medical Education and Research
Curated by ChEMBL
Assay Description
Inhibition of [3H]naxolone binding to opiate receptors in rat brain
J Med Chem 36: 2908-20 (1993)
BindingDB Entry DOI: 10.7270/Q2C24VGV
Serotonin 1 (5-HT1) receptor
(RAT-Rattus norvegicus (rat)-Rattus norvegicus (Rat...)
BDBM50045895
(2-[2-(3-Chloro-phenyl)-1H-indol-3-yl]-N,N-dipropyl...)
Show SMILES CCCN(CCC)C(=O)Cc1c([nH]c2ccccc12)-c1cccc(Cl)c1
Show InChI InChI=1S/C22H25ClN2O/c1-3-12-25(13-4-2)21(26)15-19-18-10-5-6-11-20(18)24-22(19)16-8-7-9-17(23)14-16/h5-11,14,24H,3-4,12-13,15H2,1-2H3
n/an/a>1.00E+3n/an/an/an/an/an/a
Mayo Foundation for Medical Education and Research
Curated by ChEMBL
Assay Description
Inhibitory activity by measuring its ability to displace [3H]ketanserin from serotonin receptor in rat brain
J Med Chem 36: 2908-20 (1993)
BindingDB Entry DOI: 10.7270/Q2C24VGV
Adrenergic receptor beta
(Rattus norvegicus (Rat))
BDBM50045895
(2-[2-(3-Chloro-phenyl)-1H-indol-3-yl]-N,N-dipropyl...)
Show SMILES CCCN(CCC)C(=O)Cc1c([nH]c2ccccc12)-c1cccc(Cl)c1
Show InChI InChI=1S/C22H25ClN2O/c1-3-12-25(13-4-2)21(26)15-19-18-10-5-6-11-20(18)24-22(19)16-8-7-9-17(23)14-16/h5-11,14,24H,3-4,12-13,15H2,1-2H3
n/an/a>1.00E+3n/an/an/an/an/an/a
Mayo Foundation for Medical Education and Research
Curated by ChEMBL
Assay Description
Inhibitory activity by measuring its ability to displace [125I]pindolol from beta-adrenergic receptor in rat brain
J Med Chem 36: 2908-20 (1993)
BindingDB Entry DOI: 10.7270/Q2C24VGV
Opioid receptor
(Rattus norvegicus (rat)-RAT)
BDBM50045895
(2-[2-(3-Chloro-phenyl)-1H-indol-3-yl]-N,N-dipropyl...)
Show SMILES CCCN(CCC)C(=O)Cc1c([nH]c2ccccc12)-c1cccc(Cl)c1
Show InChI InChI=1S/C22H25ClN2O/c1-3-12-25(13-4-2)21(26)15-19-18-10-5-6-11-20(18)24-22(19)16-8-7-9-17(23)14-16/h5-11,14,24H,3-4,12-13,15H2,1-2H3
Reactome pathway
n/an/a>1.00E+3n/an/an/an/an/an/a
Mayo Foundation for Medical Education and Research
Curated by ChEMBL
Assay Description
Tested for inhibitory activity by measuring its ability to displace [3H]3-PPP from opiate receptor in rat brain
J Med Chem 36: 2908-20 (1993)
BindingDB Entry DOI: 10.7270/Q2C24VGV
Adrenergic receptor alpha
(Rattus norvegicus (rat)-Rattus norvegicus (Rat)-RA...)
BDBM50045895
(2-[2-(3-Chloro-phenyl)-1H-indol-3-yl]-N,N-dipropyl...)
Show SMILES CCCN(CCC)C(=O)Cc1c([nH]c2ccccc12)-c1cccc(Cl)c1
Show InChI InChI=1S/C22H25ClN2O/c1-3-12-25(13-4-2)21(26)15-19-18-10-5-6-11-20(18)24-22(19)16-8-7-9-17(23)14-16/h5-11,14,24H,3-4,12-13,15H2,1-2H3
n/an/a>1.00E+3n/an/an/an/an/an/a
Mayo Foundation for Medical Education and Research
Curated by ChEMBL
Assay Description
Inhibitory activity by measuring its ability to displace [3H]clonidine from alpha-adrenergic receptor in rat brain
J Med Chem 36: 2908-20 (1993)
BindingDB Entry DOI: 10.7270/Q2C24VGV
Cannabinoid receptor 1
(Rattus norvegicus (rat))
BDBM50045895
(2-[2-(3-Chloro-phenyl)-1H-indol-3-yl]-N,N-dipropyl...)
Show SMILES CCCN(CCC)C(=O)Cc1c([nH]c2ccccc12)-c1cccc(Cl)c1
Show InChI InChI=1S/C22H25ClN2O/c1-3-12-25(13-4-2)21(26)15-19-18-10-5-6-11-20(18)24-22(19)16-8-7-9-17(23)14-16/h5-11,14,24H,3-4,12-13,15H2,1-2H3
Reactome pathway
n/an/a>1.00E+3n/an/an/an/an/an/a
Mayo Foundation for Medical Education and Research
Curated by ChEMBL
Assay Description
Inhibitory activity, measured by displacement [3H]-CP-55,940 from cannabinoid receptor (CB1) in rat brain
J Med Chem 36: 2908-20 (1993)
BindingDB Entry DOI: 10.7270/Q2C24VGV
Adrenergic receptor alpha
(Rattus norvegicus (rat)-Rattus norvegicus (Rat)-RA...)
BDBM50045895
(2-[2-(3-Chloro-phenyl)-1H-indol-3-yl]-N,N-dipropyl...)
Show SMILES CCCN(CCC)C(=O)Cc1c([nH]c2ccccc12)-c1cccc(Cl)c1
Show InChI InChI=1S/C22H25ClN2O/c1-3-12-25(13-4-2)21(26)15-19-18-10-5-6-11-20(18)24-22(19)16-8-7-9-17(23)14-16/h5-11,14,24H,3-4,12-13,15H2,1-2H3
n/an/a>1.00E+3n/an/an/an/an/an/a
Mayo Foundation for Medical Education and Research
Curated by ChEMBL
Assay Description
Inhibitory activity by measuring its ability to displace [3H]WB-4101 from alpha-adrenergic receptor in rat brain
J Med Chem 36: 2908-20 (1993)
BindingDB Entry DOI: 10.7270/Q2C24VGV