BDBM50046046 CHEMBL3310139
SMILES: Fc1ccc(cc1)-c1noc(NC(=O)Cc2ccccc2)c1-c1ccncn1
InChI Key: InChIKey=ZVQXUHMGCNNPGQ-UHFFFAOYSA-N
Data: 1 IC50
Activity Spreadsheet -- Enzyme Inhibition Constant Data from BindingDB
Found 1 hit for monomerid = 50046046
Trg + Lig
Ki
nM
ΔG°
kcal/mole
IC50
nM
Kd
nM
EC50/IC50
nM
koff
s-1
kon
M-1s-1
pHTemp
°C
Mitogen-activated protein kinase 14
(Homo sapiens (Human))
BDBM50046046
(CHEMBL3310139)
Show SMILES Fc1ccc(cc1)-c1noc(NC(=O)Cc2ccccc2)c1-c1ccncn1
Show InChI InChI=1S/C21H15FN4O2/c22-16-8-6-15(7-9-16)20-19(17-10-11-23-13-24-17)21(28-26-20)25-18(27)12-14-4-2-1-3-5-14/h1-11,13H,12H2,(H,25,27)
NCI pathway
Reactome pathway
n/an/a 46n/an/an/an/an/an/a
ASKA Pharmaceutical Co., Ltd
Curated by ChEMBL
Assay Description
Inhibition of full length human p38alpha MAP kinase by Off-chip mobility shift assay
Bioorg Med Chem 22: 4162-76 (2014)
Article DOI: 10.1016/j.bmc.2014.05.045
BindingDB Entry DOI: 10.7270/Q2C82BXS