BDBM50046195 4-((E)-{[(E)-amino(imino)methyl]hydrazono}methyl)pyridine-2-carboximidamide::CHEMBL151103
SMILES: NC(=N)NN=Cc1ccnc(c1)C(N)=N
InChI Key: InChIKey=DYJLAVXMPYIMOT-UHFFFAOYSA-N
Data: 2 IC50
Activity Spreadsheet -- Enzyme Inhibition Constant Data from BindingDB
Found 2 hits for monomerid = 50046195
Trg + Lig
Ki
nM
ΔG°
kcal/mole
IC50
nM
Kd
nM
EC50/IC50
nM
koff
s-1
kon
M-1s-1
pHTemp
°C
S-adenosylmethionine decarboxylase 1
(Rattus norvegicus)
BDBM50046195
(4-((E)-{[(E)-amino(imino)methyl]hydrazono}methyl)p...)
Show SMILES NC(=N)NN=Cc1ccnc(c1)C(N)=N |w:5.5|
Show InChI InChI=1S/C8H11N7/c9-7(10)6-3-5(1-2-13-6)4-14-15-8(11)12/h1-4H,(H3,9,10)(H4,11,12,15)
n/an/a 330n/an/an/an/an/an/a
Ciba-Geigy AG
Curated by ChEMBL
Assay Description
Inhibitory concentration of compound against S-Adenosylmethionine decarboxylase (SAMDC) from rat liver
J Med Chem 36: 46-54 (1993)
BindingDB Entry DOI: 10.7270/Q2FT8K3B
Diamine oxidase
(Rattus norvegicus)
BDBM50046195
(4-((E)-{[(E)-amino(imino)methyl]hydrazono}methyl)p...)
Show SMILES NC(=N)NN=Cc1ccnc(c1)C(N)=N |w:5.5|
Show InChI InChI=1S/C8H11N7/c9-7(10)6-3-5(1-2-13-6)4-14-15-8(11)12/h1-4H,(H3,9,10)(H4,11,12,15)
n/an/a 3.20E+3n/an/an/an/an/an/a
Ciba-Geigy AG
Curated by ChEMBL
Assay Description
In vitro inhibition of Diamine oxidase (DAO) from rat small intestine.
J Med Chem 36: 46-54 (1993)
BindingDB Entry DOI: 10.7270/Q2FT8K3B