BDBM50046344 1-(3-Oxo-3-phenyl-propionyl)-pyrrolidine-2-carboxylic acid (1-formyl-4-guanidino-butyl)-amide::CHEMBL317414
SMILES: NC(=N)NCCCC(NC(=O)C1CCCN1C(=O)C(=O)Cc1ccccc1)C=O
InChI Key: InChIKey=XEDMEZOIFYLIGT-UHFFFAOYSA-N
Data: 1 EC50
Activity Spreadsheet -- Enzyme Inhibition Constant Data from BindingDB
Found 1 hit for monomerid = 50046344
Trg + Lig
Ki
nM
ΔG°
kcal/mole
IC50
nM
Kd
nM
EC50/IC50
nM
koff
s-1
kon
M-1s-1
pHTemp
°C
Prothrombin
(Homo sapiens (Human))
BDBM50046344
(1-(3-Oxo-3-phenyl-propionyl)-pyrrolidine-2-carboxy...)
Show SMILES NC(=N)NCCCC(NC(=O)C1CCCN1C(=O)C(=O)Cc1ccccc1)C=O
Show InChI InChI=1S/C20H27N5O4/c21-20(22)23-10-4-8-15(13-26)24-18(28)16-9-5-11-25(16)19(29)17(27)12-14-6-2-1-3-7-14/h1-3,6-7,13,15-16H,4-5,8-12H2,(H,24,28)(H4,21,22,23)
n/an/an/an/a 590n/an/an/an/a
Bristol-Myers Squibb Pharmaceutical Research Institute
Curated by ChEMBL
Assay Description
Concentration required to inhibit thrombin hydrolysis of the chromogenic substrate
J Med Chem 36: 300-3 (1993)
BindingDB Entry DOI: 10.7270/Q2JM28Q8