BDBM50046755 2-Cyano-3-(3,5-dihydroxy-phenyl)-acrylamide::CHEMBL336450
SMILES: NC(=O)C(=C\c1cc(O)cc(O)c1)\C#N
InChI Key: InChIKey=QPRHWCGQZUBIJC-LREOWRDNSA-N
Data: 1 IC50
Activity Spreadsheet -- Enzyme Inhibition Constant Data from BindingDB
Found 1 hit for monomerid = 50046755
Trg + Lig
Ki
nM
ΔG°
kcal/mole
IC50
nM
Kd
nM
EC50/IC50
nM
koff
s-1
kon
M-1s-1
pHTemp
°C
Tyrosine-protein kinase Lck
(Homo sapiens (Human))
BDBM50046755
(2-Cyano-3-(3,5-dihydroxy-phenyl)-acrylamide | CHEM...)
Show SMILES NC(=O)C(=C\c1cc(O)cc(O)c1)\C#N
Show InChI InChI=1S/C10H8N2O3/c11-5-7(10(12)15)1-6-2-8(13)4-9(14)3-6/h1-4,13-14H,(H2,12,15)/b7-1+
n/an/a 5.00E+5n/an/an/an/an/an/a
National Cancer Institute
Curated by ChEMBL
Assay Description
Ability to inhibit autophosphorylation of immunopurified p56Ick
J Med Chem 36: 425-32 (1993)
BindingDB Entry DOI: 10.7270/Q2CV4GTQ