BDBM50046762 7,8-Dihydroxy-isoquinoline-3-carboxylic acid amide::CHEMBL48384
SMILES: NC(=O)c1cc2ccc(O)c(O)c2cn1
InChI Key: InChIKey=FIBTUUYKTWYAAG-UHFFFAOYSA-N
Data: 3 IC50
Activity Spreadsheet -- Enzyme Inhibition Constant Data from BindingDB
Found 3 hits for monomerid = 50046762
Trg + Lig
Ki
nM
ΔG°
kcal/mole
IC50
nM
Kd
nM
EC50/IC50
nM
koff
s-1
kon
M-1s-1
pHTemp
°C
Tyrosine-protein kinase Lck
(Homo sapiens (Human))
BDBM50046762
(7,8-Dihydroxy-isoquinoline-3-carboxylic acid amide...)
Show SMILES NC(=O)c1cc2ccc(O)c(O)c2cn1
Show InChI InChI=1S/C10H8N2O3/c11-10(15)7-3-5-1-2-8(13)9(14)6(5)4-12-7/h1-4,13-14H,(H2,11,15)
n/an/a 500n/an/an/an/an/an/a
National Cancer Institute
Curated by ChEMBL
Assay Description
Ability to inhibit autophosphorylation of immunopurified p56Ick
J Med Chem 36: 425-32 (1993)
BindingDB Entry DOI: 10.7270/Q2CV4GTQ
Tyrosine-protein kinase Lck
(Homo sapiens (Human))
BDBM50046762
(7,8-Dihydroxy-isoquinoline-3-carboxylic acid amide...)
Show SMILES NC(=O)c1cc2ccc(O)c(O)c2cn1
Show InChI InChI=1S/C10H8N2O3/c11-10(15)7-3-5-1-2-8(13)9(14)6(5)4-12-7/h1-4,13-14H,(H2,11,15)
n/an/a 500n/an/an/an/an/an/a
TBA
Curated by ChEMBL
Assay Description
Inhibition of p56 lck tyrosine kinase
Bioorg Med Chem Lett 2: 1771-1774 (1992)
Article DOI: 10.1016/S0960-894X(00)80473-4
BindingDB Entry DOI: 10.7270/Q2SF2W33
Epidermal growth factor receptor
(Homo sapiens (Human))
BDBM50046762
(7,8-Dihydroxy-isoquinoline-3-carboxylic acid amide...)
Show SMILES NC(=O)c1cc2ccc(O)c(O)c2cn1
Show InChI InChI=1S/C10H8N2O3/c11-10(15)7-3-5-1-2-8(13)9(14)6(5)4-12-7/h1-4,13-14H,(H2,11,15)
n/an/a>1.00E+5n/an/an/an/an/an/a
TBA
Curated by ChEMBL
Assay Description
Inhibition of epidermal growth factor receptor (EGFR)
Bioorg Med Chem Lett 2: 1771-1774 (1992)
Article DOI: 10.1016/S0960-894X(00)80473-4
BindingDB Entry DOI: 10.7270/Q2SF2W33