BDBM50046894 2-(2-Acetylamino-3-methyl-butyrylamino)-4-methyl-pentanoic acid (1-formyl-4-guanidino-butyl)-amide::CHEMBL2373062
SMILES: [#6]-[#6](-[#6])-[#6]-[#6@H](-[#7]-[#6](=O)-[#6@@H](-[#7]-[#6](-[#6])=O)-[#6](-[#6])-[#6])-[#6](=O)-[#7]-[#6@@H](-[#6]-[#6]-[#6]\[#7]=[#6](\[#7])-[#7])-[#6]=O
InChI Key: InChIKey=VTOGQBLCPOHMEG-JYJNAYRXSA-N
Data: 5 IC50
Activity Spreadsheet -- Enzyme Inhibition Constant Data from BindingDB
Found 5 hits for monomerid = 50046894
Trg + Lig
Ki
nM
ΔG°
kcal/mole
IC50
nM
Kd
nM
EC50/IC50
nM
koff
s-1
kon
M-1s-1
pHTemp
°C
Cathepsin B
(Bos taurus (bovine))
BDBM50046894
(2-(2-Acetylamino-3-methyl-butyrylamino)-4-methyl-p...)
Show SMILES [#6]-[#6](-[#6])-[#6]-[#6@H](-[#7]-[#6](=O)-[#6@@H](-[#7]-[#6](-[#6])=O)-[#6](-[#6])-[#6])-[#6](=O)-[#7]-[#6@@H](-[#6]-[#6]-[#6]\[#7]=[#6](\[#7])-[#7])-[#6]=O |r|
Show InChI InChI=1S/C19H36N6O4/c1-11(2)9-15(25-18(29)16(12(3)4)23-13(5)27)17(28)24-14(10-26)7-6-8-22-19(20)21/h10-12,14-16H,6-9H2,1-5H3,(H,23,27)(H,24,28)(H,25,29)(H4,20,21,22)/t14-,15-,16-/m0/s1
Reactome pathway
n/an/a 1.00E+5n/an/an/an/an/an/a
University of Arkansas
Curated by ChEMBL
Assay Description
Inhibition of cathepsin B with Cbz-L-lysine-p-nitrophenyl ester as substrate
J Med Chem 36: 1084-9 (1993)
BindingDB Entry DOI: 10.7270/Q24F1RCR
Thrombin
(Bos taurus (Bovine))
BDBM50046894
(2-(2-Acetylamino-3-methyl-butyrylamino)-4-methyl-p...)
Show SMILES [#6]-[#6](-[#6])-[#6]-[#6@H](-[#7]-[#6](=O)-[#6@@H](-[#7]-[#6](-[#6])=O)-[#6](-[#6])-[#6])-[#6](=O)-[#7]-[#6@@H](-[#6]-[#6]-[#6]\[#7]=[#6](\[#7])-[#7])-[#6]=O |r|
Show InChI InChI=1S/C19H36N6O4/c1-11(2)9-15(25-18(29)16(12(3)4)23-13(5)27)17(28)24-14(10-26)7-6-8-22-19(20)21/h10-12,14-16H,6-9H2,1-5H3,(H,23,27)(H,24,28)(H,25,29)(H4,20,21,22)/t14-,15-,16-/m0/s1
n/an/a 1.70E+5n/an/an/an/an/an/a
University of Arkansas
Curated by ChEMBL
Assay Description
Inhibition of thrombin with benzoyl-Phe-Val-arginine- p-nitroanilide as substrate
J Med Chem 36: 1084-9 (1993)
BindingDB Entry DOI: 10.7270/Q24F1RCR
Plasminogen
(Bos taurus)
BDBM50046894
(2-(2-Acetylamino-3-methyl-butyrylamino)-4-methyl-p...)
Show SMILES [#6]-[#6](-[#6])-[#6]-[#6@H](-[#7]-[#6](=O)-[#6@@H](-[#7]-[#6](-[#6])=O)-[#6](-[#6])-[#6])-[#6](=O)-[#7]-[#6@@H](-[#6]-[#6]-[#6]\[#7]=[#6](\[#7])-[#7])-[#6]=O |r|
Show InChI InChI=1S/C19H36N6O4/c1-11(2)9-15(25-18(29)16(12(3)4)23-13(5)27)17(28)24-14(10-26)7-6-8-22-19(20)21/h10-12,14-16H,6-9H2,1-5H3,(H,23,27)(H,24,28)(H,25,29)(H4,20,21,22)/t14-,15-,16-/m0/s1
n/an/a 6.50E+4n/an/an/an/an/an/a
University of Arkansas
Curated by ChEMBL
Assay Description
Inhibition of plasmin with Val-L-Leu-L-lysine-p-nitroanilide as substrate
J Med Chem 36: 1084-9 (1993)
BindingDB Entry DOI: 10.7270/Q24F1RCR
Plasma kallikrein
(Homo sapiens (Human))
BDBM50046894
(2-(2-Acetylamino-3-methyl-butyrylamino)-4-methyl-p...)
Show SMILES [#6]-[#6](-[#6])-[#6]-[#6@H](-[#7]-[#6](=O)-[#6@@H](-[#7]-[#6](-[#6])=O)-[#6](-[#6])-[#6])-[#6](=O)-[#7]-[#6@@H](-[#6]-[#6]-[#6]\[#7]=[#6](\[#7])-[#7])-[#6]=O |r|
Show InChI InChI=1S/C19H36N6O4/c1-11(2)9-15(25-18(29)16(12(3)4)23-13(5)27)17(28)24-14(10-26)7-6-8-22-19(20)21/h10-12,14-16H,6-9H2,1-5H3,(H,23,27)(H,24,28)(H,25,29)(H4,20,21,22)/t14-,15-,16-/m0/s1
n/an/a 1.90E+4n/an/an/an/an/an/a
University of Arkansas
Curated by ChEMBL
Assay Description
Inhibition of kallikrein with benzoyl-L-arginine ethyl ester as substrate
J Med Chem 36: 1084-9 (1993)
BindingDB Entry DOI: 10.7270/Q24F1RCR
Trypsin
(Bos taurus (bovine))
BDBM50046894
(2-(2-Acetylamino-3-methyl-butyrylamino)-4-methyl-p...)
Show SMILES [#6]-[#6](-[#6])-[#6]-[#6@H](-[#7]-[#6](=O)-[#6@@H](-[#7]-[#6](-[#6])=O)-[#6](-[#6])-[#6])-[#6](=O)-[#7]-[#6@@H](-[#6]-[#6]-[#6]\[#7]=[#6](\[#7])-[#7])-[#6]=O |r|
Show InChI InChI=1S/C19H36N6O4/c1-11(2)9-15(25-18(29)16(12(3)4)23-13(5)27)17(28)24-14(10-26)7-6-8-22-19(20)21/h10-12,14-16H,6-9H2,1-5H3,(H,23,27)(H,24,28)(H,25,29)(H4,20,21,22)/t14-,15-,16-/m0/s1
n/an/a 1.30E+5n/an/an/an/an/an/a
University of Arkansas
Curated by ChEMBL
Assay Description
Inhibition of trypsin with benzoyl-L-arginine ethyl ester as substrate
J Med Chem 36: 1084-9 (1993)
BindingDB Entry DOI: 10.7270/Q24F1RCR