null
SMILES: Fc1ccc2[nH]cc(CC3CCN(CCN4C(=O)c5cccc6cccc4c56)CC3)c2c1
InChI Key: InChIKey=WRHKYIREOIGMLR-UHFFFAOYSA-N
Activity Spreadsheet -- Enzyme Inhibition Constant Data from BindingDB
Found 2 hits for monomerid = 50047102
Trg + Lig
Ki
nM
ΔG°
kcal/mole
IC50
nM
Kd
nM
EC50/IC50
nM
koff
s-1
kon
M-1s-1
pHTemp
°C
Sodium-dependent serotonin transporter
(Rattus norvegicus (rat))
BDBM50047102
(1-{2-[4-(5-Fluoro-1H-indol-3-ylmethyl)-piperidin-1...)
Show SMILES Fc1ccc2[nH]cc(CC3CCN(CCN4C(=O)c5cccc6cccc4c56)CC3)c2c1
Show InChI InChI=1S/C27H26FN3O/c28-21-7-8-24-23(16-21)20(17-29-24)15-18-9-11-30(12-10-18)13-14-31-25-6-2-4-19-3-1-5-22(26(19)25)27(31)32/h1-8,16-18,29H,9-15H2
n/an/a 1.70n/an/an/an/an/an/a
Centre de Recherches de Vitry-Alfortville
Curated by ChEMBL
Assay Description
Inhibition of [3H]-peroxitine binding to rat cortical membranes as measure of inhibitory activity towards 5-HT uptake
J Med Chem 36: 1194-202 (1993)
BindingDB Entry DOI: 10.7270/Q2MC8Z3Z
D(2) dopamine receptor
(Rattus norvegicus (rat))
BDBM50047102
(1-{2-[4-(5-Fluoro-1H-indol-3-ylmethyl)-piperidin-1...)
Show SMILES Fc1ccc2[nH]cc(CC3CCN(CCN4C(=O)c5cccc6cccc4c56)CC3)c2c1
Show InChI InChI=1S/C27H26FN3O/c28-21-7-8-24-23(16-21)20(17-29-24)15-18-9-11-30(12-10-18)13-14-31-25-6-2-4-19-3-1-5-22(26(19)25)27(31)32/h1-8,16-18,29H,9-15H2
Reactome pathway
n/an/a>100n/an/an/an/an/an/a
Centre de Recherches de Vitry-Alfortville
Curated by ChEMBL
Assay Description
Binding affinity at dopamine receptor D2 by the inhibition of binding to [3H]-spiperone in rat striatal membranes
J Med Chem 36: 1194-202 (1993)
BindingDB Entry DOI: 10.7270/Q2MC8Z3Z