BDBM50047113 2,6-Dimethyl-3-phenyl-4-[2'-(1H-tetrazol-5-yl)-biphenyl-4-ylmethoxy]-pyridine::CHEMBL281192
SMILES: Cc1cc(OCc2ccc(cc2)-c2ccccc2-c2nnn[nH]2)c(c(C)n1)-c1ccccc1
InChI Key: InChIKey=NZPOOSCEGSJCJK-UHFFFAOYSA-N
Data: 1 IC50
Activity Spreadsheet -- Enzyme Inhibition Constant Data from BindingDB
Found 1 hit for monomerid = 50047113
Trg + Lig
Ki
nM
ΔG°
kcal/mole
IC50
nM
Kd
nM
EC50/IC50
nM
koff
s-1
kon
M-1s-1
pHTemp
°C
Type-1 angiotensin II receptor
(Cavia porcellus)
BDBM50047113
(2,6-Dimethyl-3-phenyl-4-[2'-(1H-tetrazol-5-yl)-bip...)
Show SMILES Cc1cc(OCc2ccc(cc2)-c2ccccc2-c2nnn[nH]2)c(c(C)n1)-c1ccccc1
Show InChI InChI=1S/C27H23N5O/c1-18-16-25(26(19(2)28-18)22-8-4-3-5-9-22)33-17-20-12-14-21(15-13-20)23-10-6-7-11-24(23)27-29-31-32-30-27/h3-16H,17H2,1-2H3,(H,29,30,31,32)
n/an/a 6n/an/an/an/an/an/a
ZENECA Pharmaceuticals
Curated by ChEMBL
Assay Description
Inhibition of [125I]-Angiotensin binding to a guinea pig adrenal membrane preparation which corresponds to Angiotensin II receptor, type 1
J Med Chem 36: 1245-54 (1993)
BindingDB Entry DOI: 10.7270/Q2GM86CM