null
SMILES: CCc1cc(OCc2ccc(cc2)-c2ccccc2-c2nnn[nH]2)c(C(=O)OC)c(CC)n1
InChI Key: InChIKey=MWRVYNFBHCKLNO-UHFFFAOYSA-N
Activity Spreadsheet -- Enzyme Inhibition Constant Data from BindingDB
Found 1 hit for monomerid = 50047117
Trg + Lig
Ki
nM
ΔG°
kcal/mole
IC50
nM
Kd
nM
EC50/IC50
nM
koff
s-1
kon
M-1s-1
pHTemp
°C
Type-1 angiotensin II receptor
(Cavia porcellus)
BDBM50047117
(2,6-Diethyl-4-[2'-(1H-tetrazol-5-yl)-biphenyl-4-yl...)
Show SMILES CCc1cc(OCc2ccc(cc2)-c2ccccc2-c2nnn[nH]2)c(C(=O)OC)c(CC)n1
Show InChI InChI=1S/C25H25N5O3/c1-4-18-14-22(23(25(31)32-3)21(5-2)26-18)33-15-16-10-12-17(13-11-16)19-8-6-7-9-20(19)24-27-29-30-28-24/h6-14H,4-5,15H2,1-3H3,(H,27,28,29,30)
n/an/a 5n/an/an/an/an/an/a
ZENECA Pharmaceuticals
Curated by ChEMBL
Assay Description
Inhibition of [125I]-Angiotensin binding to a guinea pig adrenal membrane preparation which corresponds to Angiotensin II receptor, type 1
J Med Chem 36: 1245-54 (1993)
BindingDB Entry DOI: 10.7270/Q2GM86CM