BDBM50047131 1-{2,6-Dimethyl-4-[2'-(1H-tetrazol-5-yl)-biphenyl-4-ylmethoxy]-pyridin-3-yl}-ethanone::CHEMBL22908
SMILES: CC(=O)c1c(C)nc(C)cc1OCc1ccc(cc1)-c1ccccc1-c1nnn[nH]1
InChI Key: InChIKey=LHXAGPCKQWWRNE-UHFFFAOYSA-N
Data: 1 IC50
Activity Spreadsheet -- Enzyme Inhibition Constant Data from BindingDB
Found 1 hit for monomerid = 50047131
Trg + Lig
Ki
nM
ΔG°
kcal/mole
IC50
nM
Kd
nM
EC50/IC50
nM
koff
s-1
kon
M-1s-1
pHTemp
°C
Type-1 angiotensin II receptor
(Cavia porcellus)
BDBM50047131
(1-{2,6-Dimethyl-4-[2'-(1H-tetrazol-5-yl)-biphenyl-...)
Show SMILES CC(=O)c1c(C)nc(C)cc1OCc1ccc(cc1)-c1ccccc1-c1nnn[nH]1
Show InChI InChI=1S/C23H21N5O2/c1-14-12-21(22(16(3)29)15(2)24-14)30-13-17-8-10-18(11-9-17)19-6-4-5-7-20(19)23-25-27-28-26-23/h4-12H,13H2,1-3H3,(H,25,26,27,28)
n/an/a 30n/an/an/an/an/an/a
ZENECA Pharmaceuticals
Curated by ChEMBL
Assay Description
Inhibition of [125I]-Angiotensin binding to a guinea pig adrenal membrane preparation which corresponds to Angiotensin II receptor, type 1
J Med Chem 36: 1245-54 (1993)
BindingDB Entry DOI: 10.7270/Q2GM86CM