null
SMILES: CCc1cc(OCc2ccc(cc2)-c2ccccc2-c2nnn[nH]2)c(C(=O)c2ccccc2)c(C)n1
InChI Key: InChIKey=JFEPGTOTZOFEHZ-UHFFFAOYSA-N
Activity Spreadsheet -- Enzyme Inhibition Constant Data from BindingDB
Found 1 hit for monomerid = 50047133
Trg + Lig
Ki
nM
ΔG°
kcal/mole
IC50
nM
Kd
nM
EC50/IC50
nM
koff
s-1
kon
M-1s-1
pHTemp
°C
Type-1 angiotensin II receptor
(Cavia porcellus)
BDBM50047133
(CHEMBL434768 | {6-Ethyl-2-methyl-4-[2'-(1H-tetrazo...)
Show SMILES CCc1cc(OCc2ccc(cc2)-c2ccccc2-c2nnn[nH]2)c(C(=O)c2ccccc2)c(C)n1
Show InChI InChI=1S/C29H25N5O2/c1-3-23-17-26(27(19(2)30-23)28(35)22-9-5-4-6-10-22)36-18-20-13-15-21(16-14-20)24-11-7-8-12-25(24)29-31-33-34-32-29/h4-17H,3,18H2,1-2H3,(H,31,32,33,34)
n/an/a 4n/an/an/an/an/an/a
ZENECA Pharmaceuticals
Curated by ChEMBL
Assay Description
Inhibition of [125I]-Angiotensin binding to a guinea pig adrenal membrane preparation which corresponds to Angiotensin II receptor, type 1
J Med Chem 36: 1245-54 (1993)
BindingDB Entry DOI: 10.7270/Q2GM86CM