BDBM50047188 CHEMBL3314561
SMILES: CO[C@H]1CN(CC[C@H]1NC(=O)c1[nH]c(C)c(Cl)c1Cl)c1nc(C(O)=O)c(s1)C(N)=O
InChI Key: InChIKey=PFMLBVPPYCWNMM-SFYZADRCSA-N
Data: 1 IC50
Activity Spreadsheet -- Enzyme Inhibition Constant Data from BindingDB
Found 1 hit for monomerid = 50047188
Trg + Lig
Ki
nM
ΔG°
kcal/mole
IC50
nM
Kd
nM
EC50/IC50
nM
koff
s-1
kon
M-1s-1
pHTemp
°C
DNA Gyrase Subunit B
(Staphylococcus aureus)
BDBM50047188
(CHEMBL3314561)
Show SMILES CO[C@H]1CN(CC[C@H]1NC(=O)c1[nH]c(C)c(Cl)c1Cl)c1nc(C(O)=O)c(s1)C(N)=O |r|
Show InChI InChI=1S/C17H19Cl2N5O5S/c1-6-9(18)10(19)11(21-6)15(26)22-7-3-4-24(5-8(7)29-2)17-23-12(16(27)28)13(30-17)14(20)25/h7-8,21H,3-5H2,1-2H3,(H2,20,25)(H,22,26)(H,27,28)/t7-,8+/m1/s1
n/an/a<10n/an/an/an/an/an/a
AstraZeneca
Curated by ChEMBL
Assay Description
Inhibition of ATPase activity of Staphylococcus aureus GyrB
J Med Chem 57: 6060-82 (2014)
Article DOI: 10.1021/jm500462x
BindingDB Entry DOI: 10.7270/Q24J0GR1