BDBM50047423 CHEMBL3319402
SMILES: CCN(CC)CCCS(=O)(=O)c1ccc2nc(NC(=O)NC(=O)c3cc(ccc3Cl)N3CCOCC3)sc2c1
InChI Key: InChIKey=WARRHAYFCANTSN-UHFFFAOYSA-N
Data: 1 IC50
Activity Spreadsheet -- Enzyme Inhibition Constant Data from BindingDB
Found 1 hit for monomerid = 50047423
Trg + Lig
Ki
nM
ΔG°
kcal/mole
IC50
nM
Kd
nM
EC50/IC50
nM
koff
s-1
kon
M-1s-1
pHTemp
°C
Ghrelin receptor
(Homo sapiens (Human))
BDBM50047423
(CHEMBL3319402)
Show SMILES CCN(CC)CCCS(=O)(=O)c1ccc2nc(NC(=O)NC(=O)c3cc(ccc3Cl)N3CCOCC3)sc2c1
Show InChI InChI=1S/C26H32ClN5O5S2/c1-3-31(4-2)10-5-15-39(35,36)19-7-9-22-23(17-19)38-26(28-22)30-25(34)29-24(33)20-16-18(6-8-21(20)27)32-11-13-37-14-12-32/h6-9,16-17H,3-5,10-15H2,1-2H3,(H2,28,29,30,33,34)
Reactome pathway
n/an/a 2.90n/an/an/an/an/an/a
AstraZeneca
Curated by ChEMBL
Assay Description
Displacement of [125I]human ghrelin from human GHS-R1a expressed in HEK cell membranes after 60 mins by gamma counting method
J Med Chem 57: 6128-40 (2014)
Article DOI: 10.1021/jm500610n
BindingDB Entry DOI: 10.7270/Q279469X