BDBM50047782 2-{[Acetyl-(3-methoxy-4-tetradecyloxy-benzoyl)-amino]-methyl}-1-methyl-pyridinium; iodide::CHEMBL157123
SMILES: CCCCCCCCCCCCCCOc1ccc(cc1OC)C(=O)N(Cc1cccc[n+]1C)C(C)=O
InChI Key: InChIKey=KORGKYFIBBYIQJ-UHFFFAOYSA-N
Data: 1 IC50
Activity Spreadsheet -- Enzyme Inhibition Constant Data from BindingDB
Found 1 hit for monomerid = 50047782
Trg + Lig
Ki
nM
ΔG°
kcal/mole
IC50
nM
Kd
nM
EC50/IC50
nM
koff
s-1
kon
M-1s-1
pHTemp
°C
Platelet activating factor receptor
(Cavia porcellus)
BDBM50047782
(2-{[Acetyl-(3-methoxy-4-tetradecyloxy-benzoyl)-ami...)
Show SMILES CCCCCCCCCCCCCCOc1ccc(cc1OC)C(=O)N(Cc1cccc[n+]1C)C(C)=O
Show InChI InChI=1S/C31H47N2O4/c1-5-6-7-8-9-10-11-12-13-14-15-18-23-37-29-21-20-27(24-30(29)36-4)31(35)33(26(2)34)25-28-19-16-17-22-32(28)3/h16-17,19-22,24H,5-15,18,23,25H2,1-4H3/q+1
Reactome pathway
n/an/a 64n/an/an/an/an/an/a
American Cyanamid Company
Curated by ChEMBL
Assay Description
Inhibition of PAF-induced platelet aggregation in rabbit platelet rich plasma
J Med Chem 36: 580-90 (1993)
BindingDB Entry DOI: 10.7270/Q2SX6C9X